Sunday, July 1, 2007

mod_ruby on CentOS-5

I was trying to install mod_ruby on my CentOS-5 today and that seemed to be a bit tricky. First of all, as far as I know, CentOS does not have a prebuilt mod_ruby package. That leaves little other options than compiling the package from source. I found this page, containing a howto for CentOS-3, but it didn't quite work on CentOS-5.



I found that after having installed the httpd-devel, ruby-devel, ruby and httpd packages on CentOS-5, simply running ./configure does not do the trick. One needs to run ./configure.rb --with-apxs=/usr/sbin/apxs --with-apr-includes=/usr/include/apr-1 in order to have the install script find the proper header files. Running the make command after that gives a succesfull build againt both /usr/include/httpd and /usr/include/apr-1 for some reason.



Then, put the following in /etc/httpd/conf.d/ruby.conf:




RubySafeLevel 0

# If you use RubyGems

RubyRequire rubygems

RubyRequire apache/rails-dispatcher

RubyTransHandler Apache::RailsDispatcher.instance



SetHandler ruby-object

RubyHandler Apache::RailsDispatcher.instance

RubyOption railsuriroot /ruby-application-name

RubyOption rails_root /path/to/rails/root

RubyOption rails_env production




(Thanks to carl at the above mentioned page for this!)



Carl's howto puts all this text in httpd.conf. This works, but better stay consistent with the way CentOS handles things. Also, the howto on carl's page has the require line for rubygems commented out. Take special care to require rubygems though! CentOS has no packages for rails, so it's safe to assume you have installed rails from gems. If you do not require rubygems, the setup will silently fail (unless you go through /var/log/httpd/error_log).



I have yet to test this, but it should work nicely.



Update: Well, I cheered too soon. What seems to be the problem is some incompatibility between the (quite old) version of modruby available for download and my (quite recent) version of rails. Probably solvable, but I don't really feel like it. Besides, I decided that it will be much more convenient to use modproxy on Apache and place several of my home-brew rails applications behind it. I'll post a nice how-to for that some day.

2 comments:

Abdullah said...

No luck installing mod_ruby on CentOS 5.2 64bit version. I was able to install on 32bit version. HELP.

see the detailed log below...

[root@zapa mod_ruby-1.2.6]# make
gcc -O2 -g -pipe -Wall -Wp,-D_FORTIFY_SOURCE=2 -fexceptions -fstack-protector --param=ssp-buffer-size=4 -m64 -mtune=generic -Wall -fPIC -Wall -O2 -g -pipe -Wall -Wp,-D_FORTIFY_SOURCE=2 -fexceptions -fstack-protector --param=ssp-buffer-size=4 -m64 -mtune=generic -DLINUX=2 -D_REENTRANT -D_GNU_SOURCE -pthread -I. -I/usr/lib64/ruby/1.8/x86_64-linux -I/usr/include/httpd -I/usr/include/apr-1 -c mod_ruby.c
In file included from /usr/include/httpd/ap_config.h:25,
from /usr/include/httpd/httpd.h:43,
from mod_ruby.h:52,
from mod_ruby.c:33:
/usr/include/apr-1/apr.h:19:24: error: apr-x86_64.h: No such file or directory
In file included from /usr/include/apr-1/apr_pools.h:38,
from /usr/include/apr-1/apr_tables.h:26,
from /usr/include/apr-1/apr_hooks.h:22,
from /usr/include/httpd/ap_config.h:26,
from /usr/include/httpd/httpd.h:43,
from mod_ruby.h:52,
from mod_ruby.c:33:
/usr/include/apr-1/apr_errno.h:52: warning: return type defaults to âintâ
/usr/include/apr-1/apr_errno.h: In function âAPR_DECLAREâ:
/usr/include/apr-1/apr_errno.h:52: error: expected declaration specifiers before âapr_strerrorâ
In file included from /usr/include/apr-1/apr_pools.h:39,
from /usr/include/apr-1/apr_tables.h:26,
from /usr/include/apr-1/apr_hooks.h:22,
from /usr/include/httpd/ap_config.h:26,
from /usr/include/httpd/httpd.h:43,
from mod_ruby.h:52,
from mod_ruby.c:33:
/usr/include/apr-1/apr_general.h:68: error: storage class specified for parameter âapr_signum_tâ
In file included from /usr/include/apr-1/apr_pools.h:39,
from /usr/include/apr-1/apr_tables.h:26,
from /usr/include/apr-1/apr_hooks.h:22,
from /usr/include/httpd/ap_config.h:26,
from /usr/include/httpd/httpd.h:43,
from mod_ruby.h:52,
from mod_ruby.c:33:
/usr/include/apr-1/apr_general.h:156:1: warning: "memmove" redefined
In file included from /usr/include/string.h:422,
from /usr/lib64/ruby/1.8/x86_64-linux/ruby.h:35,
from mod_ruby.h:33,
from mod_ruby.c:33:
/usr/include/bits/string3.h:55:1: warning: this is the location of the previous definition
/usr/include/apr-1/apr_general.h:176: error: expected declaration specifiers before âAPR_DECLAREâ
/usr/include/apr-1/apr_general.h:190: error: expected declaration specifiers before âAPR_DECLAREâ
/usr/include/apr-1/apr_general.h:203: error: expected declaration specifiers before âAPR_DECLARE_NONSTDâ
/usr/include/apr-1/apr_general.h:214: error: expected declaration specifiers before âAPR_DECLAREâ
In file included from /usr/include/apr-1/apr_tables.h:26,
from /usr/include/apr-1/apr_hooks.h:22,
from /usr/include/httpd/ap_config.h:26,
from /usr/include/httpd/httpd.h:43,
from mod_ruby.h:52,
from mod_ruby.c:33:
/usr/include/apr-1/apr_pools.h:54: error: storage class specified for parameter âapr_pool_tâ
/usr/include/apr-1/apr_pools.h:142: error: storage class specified for parameter âapr_abortfunc_tâ
/usr/include/apr-1/apr_pools.h:158: error: expected declaration specifiers before âAPR_DECLAREâ
/usr/include/apr-1/apr_pools.h:166: error: expected declaration specifiers before âAPR_DECLAREâ
In file included from /usr/include/apr-1/apr_pools.h:173,
from /usr/include/apr-1/apr_tables.h:26,
from /usr/include/apr-1/apr_hooks.h:22,
from /usr/include/httpd/ap_config.h:26,
from /usr/include/httpd/httpd.h:43,
from mod_ruby.h:52,
from mod_ruby.c:33:
/usr/include/apr-1/apr_allocator.h:41: error: storage class specified for parameter âapr_allocator_tâ
/usr/include/apr-1/apr_allocator.h:43: error: storage class specified for parameter âapr_memnode_tâ
/usr/include/apr-1/apr_allocator.h:55: error: expected specifier-qualifier-list before âapr_memnode_tâ
/usr/include/apr-1/apr_allocator.h:61: warning: empty declaration
/usr/include/apr-1/apr_allocator.h:74: error: expected declaration specifiers before âAPR_DECLAREâ
/usr/include/apr-1/apr_allocator.h:82: error: expected declaration specifiers before âAPR_DECLAREâ
/usr/include/apr-1/apr_allocator.h:90: error: expected declaration specifiers before âAPR_DECLAREâ
/usr/include/apr-1/apr_allocator.h:100: error: expected declaration specifiers before âAPR_DECLAREâ
/usr/include/apr-1/apr_allocator.h:116: error: expected declaration specifiers before âAPR_DECLAREâ
/usr/include/apr-1/apr_allocator.h:123: error: expected declaration specifiers before âAPR_DECLAREâ
/usr/include/apr-1/apr_allocator.h:131: error: expected declaration specifiers before âAPR_DECLAREâ
In file included from /usr/include/apr-1/apr_tables.h:26,
from /usr/include/apr-1/apr_hooks.h:22,
from /usr/include/httpd/ap_config.h:26,
from /usr/include/httpd/httpd.h:43,
from mod_ruby.h:52,
from mod_ruby.c:33:
/usr/include/apr-1/apr_pools.h:186: error: expected declaration specifiers before âAPR_DECLAREâ
/usr/include/apr-1/apr_pools.h:207: error: expected declaration specifiers before âAPR_DECLAREâ
/usr/include/apr-1/apr_pools.h:245: error: expected declaration specifiers before âAPR_DECLAREâ
/usr/include/apr-1/apr_pools.h:255: error: expected declaration specifiers before âAPR_DECLAREâ
/usr/include/apr-1/apr_pools.h:270: error: expected declaration specifiers before âAPR_DECLAREâ
/usr/include/apr-1/apr_pools.h:284: error: expected declaration specifiers before âAPR_DECLAREâ
/usr/include/apr-1/apr_pools.h:299: error: expected declaration specifiers before âAPR_DECLAREâ
/usr/include/apr-1/apr_pools.h:318: error: expected declaration specifiers before âAPR_DECLAREâ
/usr/include/apr-1/apr_pools.h:328: error: expected declaration specifiers before âAPR_DECLAREâ
/usr/include/apr-1/apr_pools.h:356: error: expected declaration specifiers before âAPR_DECLAREâ
/usr/include/apr-1/apr_pools.h:377: error: expected declaration specifiers before âAPR_DECLAREâ
/usr/include/apr-1/apr_pools.h:385: error: expected declaration specifiers before âAPR_DECLAREâ
/usr/include/apr-1/apr_pools.h:392: error: expected declaration specifiers before âAPR_DECLAREâ
/usr/include/apr-1/apr_pools.h:405: error: expected declaration specifiers before âAPR_DECLAREâ
/usr/include/apr-1/apr_pools.h:412: error: expected declaration specifiers before âAPR_DECLAREâ
/usr/include/apr-1/apr_pools.h:438: error: expected declaration specifiers before âAPR_DECLAREâ
/usr/include/apr-1/apr_pools.h:463: error: expected declaration specifiers before âAPR_DECLAREâ
/usr/include/apr-1/apr_pools.h:475: error: expected declaration specifiers before âAPR_DECLAREâ
/usr/include/apr-1/apr_pools.h:502: error: expected declaration specifiers before âAPR_DECLAREâ
/usr/include/apr-1/apr_pools.h:520: error: expected declaration specifiers before âAPR_DECLAREâ
/usr/include/apr-1/apr_pools.h:535: error: expected declaration specifiers before âAPR_DECLAREâ
/usr/include/apr-1/apr_pools.h:552: error: expected declaration specifiers before âAPR_DECLAREâ
/usr/include/apr-1/apr_pools.h:564: error: expected declaration specifiers before âAPR_DECLARE_NONSTDâ
/usr/include/apr-1/apr_pools.h:572: error: expected declaration specifiers before âAPR_DECLAREâ
In file included from /usr/include/apr-1/apr_hooks.h:22,
from /usr/include/httpd/ap_config.h:26,
from /usr/include/httpd/httpd.h:43,
from mod_ruby.h:52,
from mod_ruby.c:33:
/usr/include/apr-1/apr_tables.h:46: error: storage class specified for parameter âapr_table_tâ
/usr/include/apr-1/apr_tables.h:49: error: storage class specified for parameter âapr_array_header_tâ
/usr/include/apr-1/apr_tables.h:54: error: expected specifier-qualifier-list before âapr_pool_tâ
/usr/include/apr-1/apr_tables.h:63: warning: empty declaration
/usr/include/apr-1/apr_tables.h:68: error: storage class specified for parameter âapr_table_entry_tâ
/usr/include/apr-1/apr_tables.h:80: error: expected specifier-qualifier-list before âapr_uint32_tâ
/usr/include/apr-1/apr_tables.h:81: warning: empty declaration
/usr/include/apr-1/apr_tables.h:88: error: expected declaration specifiers before âAPR_DECLAREâ
/usr/include/apr-1/apr_tables.h:95: error: expected declaration specifiers before âAPR_DECLAREâ
/usr/include/apr-1/apr_tables.h:102: error: expected declaration specifiers before âAPR_DECLAREâ
/usr/include/apr-1/apr_tables.h:111: error: expected declaration specifiers before âAPR_DECLAREâ
/usr/include/apr-1/apr_tables.h:121: error: expected declaration specifiers before âAPR_DECLAREâ
/usr/include/apr-1/apr_tables.h:129: error: expected declaration specifiers before âAPR_DECLAREâ
/usr/include/apr-1/apr_tables.h:137: error: expected declaration specifiers before âAPR_DECLAREâ
/usr/include/apr-1/apr_tables.h:149: error: expected declaration specifiers before âAPR_DECLAREâ
/usr/include/apr-1/apr_tables.h:159: error: expected declaration specifiers before âAPR_DECLAREâ
/usr/include/apr-1/apr_tables.h:169: error: expected declaration specifiers before âAPR_DECLAREâ
/usr/include/apr-1/apr_tables.h:184: error: expected declaration specifiers before âAPR_DECLAREâ
/usr/include/apr-1/apr_tables.h:195: error: expected declaration specifiers before âAPR_DECLAREâ
/usr/include/apr-1/apr_tables.h:203: error: expected declaration specifiers before âAPR_DECLAREâ
/usr/include/apr-1/apr_tables.h:210: error: expected declaration specifiers before âAPR_DECLAREâ
/usr/include/apr-1/apr_tables.h:219: error: expected declaration specifiers before âAPR_DECLAREâ
/usr/include/apr-1/apr_tables.h:230: error: expected declaration specifiers before âAPR_DECLAREâ
/usr/include/apr-1/apr_tables.h:243: error: expected declaration specifiers before âAPR_DECLAREâ
/usr/include/apr-1/apr_tables.h:251: error: expected declaration specifiers before âAPR_DECLAREâ
/usr/include/apr-1/apr_tables.h:261: error: expected declaration specifiers before âAPR_DECLAREâ
/usr/include/apr-1/apr_tables.h:272: error: expected declaration specifiers before âAPR_DECLAREâ
/usr/include/apr-1/apr_tables.h:284: error: expected declaration specifiers before âAPR_DECLAREâ
/usr/include/apr-1/apr_tables.h:297: error: expected declaration specifiers before âAPR_DECLAREâ
/usr/include/apr-1/apr_tables.h:307: error: expected declaration specifiers before âAPR_DECLAREâ
/usr/include/apr-1/apr_tables.h:322: error: storage class specified for parameter âapr_table_do_callback_fn_tâ
/usr/include/apr-1/apr_tables.h:340: error: expected declaration specifiers before âAPR_DECLARE_NONSTDâ
/usr/include/apr-1/apr_tables.h:359: error: expected declaration specifiers before âAPR_DECLAREâ
/usr/include/apr-1/apr_tables.h:403: error: expected declaration specifiers before âAPR_DECLAREâ
/usr/include/apr-1/apr_tables.h:414: error: expected declaration specifiers before âAPR_DECLAREâ
In file included from /usr/include/httpd/ap_config.h:26,
from /usr/include/httpd/httpd.h:43,
from mod_ruby.h:52,
from mod_ruby.c:33:
/usr/include/apr-1/apr_hooks.h:210: error: expected â=â, â,â, â;â, âasmâ or â__attribute__â before â*â token
/usr/include/apr-1/apr_hooks.h:216: error: storage class specified for parameter âapr_hook_debug_enabledâ
/usr/include/apr-1/apr_hooks.h:221: error: storage class specified for parameter âapr_hook_debug_currentâ
/usr/include/apr-1/apr_hooks.h:229: error: expected declaration specifiers or â...â before âapr_array_header_tâ
In file included from /usr/include/httpd/ap_config.h:27,
from /usr/include/httpd/httpd.h:43,
from mod_ruby.h:52,
from mod_ruby.c:33:
/usr/include/apr-1/apr_optional_hooks.h:74: error: expected declaration specifiers before âapr_array_header_tâ
In file included from /usr/include/httpd/httpd.h:52,
from mod_ruby.h:52,
from mod_ruby.c:33:
/usr/include/apr-1/apr_time.h:40: error: expected declaration specifiers before âAPR_DECLARE_DATAâ
/usr/include/apr-1/apr_time.h:42: error: expected declaration specifiers before âAPR_DECLARE_DATAâ
/usr/include/apr-1/apr_time.h:46: error: expected â=â, â,â, â;â, âasmâ or â__attribute__â before âapr_time_tâ
/usr/include/apr-1/apr_time.h:56: error: expected â=â, â,â, â;â, âasmâ or â__attribute__â before âapr_interval_time_tâ
/usr/include/apr-1/apr_time.h:58: error: expected â=â, â,â, â;â, âasmâ or â__attribute__â before âapr_short_interval_time_tâ
/usr/include/apr-1/apr_time.h:85: error: expected declaration specifiers before âAPR_DECLAREâ
/usr/include/apr-1/apr_time.h:88: error: storage class specified for parameter âapr_time_exp_tâ
/usr/include/apr-1/apr_time.h:97: error: expected specifier-qualifier-list before âapr_int32_tâ
/usr/include/apr-1/apr_time.h:118: warning: empty declaration
/usr/include/apr-1/apr_time.h:125: error: expected declaration specifiers before âAPR_DECLAREâ
/usr/include/apr-1/apr_time.h:135: error: expected declaration specifiers before âAPR_DECLAREâ
/usr/include/apr-1/apr_time.h:144: error: expected declaration specifiers before âAPR_DECLAREâ
/usr/include/apr-1/apr_time.h:152: error: expected declaration specifiers before âAPR_DECLAREâ
/usr/include/apr-1/apr_time.h:161: error: expected declaration specifiers before âAPR_DECLAREâ
/usr/include/apr-1/apr_time.h:170: error: expected declaration specifiers before âAPR_DECLAREâ
/usr/include/apr-1/apr_time.h:178: error: expected declaration specifiers before âAPR_DECLAREâ
/usr/include/apr-1/apr_time.h:190: error: expected declaration specifiers before âAPR_DECLAREâ
/usr/include/apr-1/apr_time.h:204: error: expected declaration specifiers before âAPR_DECLAREâ
/usr/include/apr-1/apr_time.h:214: error: expected declaration specifiers before âAPR_DECLAREâ
/usr/include/apr-1/apr_time.h:224: error: expected declaration specifiers before âAPR_DECLAREâ
In file included from /usr/include/apr-1/apr_file_info.h:26,
from /usr/include/apr-1/apr_file_io.h:29,
from /usr/include/apr-1/apr_network_io.h:26,
from /usr/include/httpd/httpd.h:53,
from mod_ruby.h:52,
from mod_ruby.c:33:
/usr/include/apr-1/apr_user.h:45: error: storage class specified for parameter âapr_uid_tâ
/usr/include/apr-1/apr_user.h:54: error: storage class specified for parameter âapr_gid_tâ
In file included from /usr/include/apr-1/apr_file_io.h:29,
from /usr/include/apr-1/apr_network_io.h:26,
from /usr/include/httpd/httpd.h:53,
from mod_ruby.h:52,
from mod_ruby.c:33:
/usr/include/apr-1/apr_file_info.h:72: error: storage class specified for parameter âapr_filetype_eâ
/usr/include/apr-1/apr_file_info.h:121: error: storage class specified for parameter âapr_dir_tâ
/usr/include/apr-1/apr_file_info.h:125: error: expected â=â, â,â, â;â, âasmâ or â__attribute__â before âapr_fileperms_tâ
/usr/include/apr-1/apr_file_info.h:137: error: storage class specified for parameter âapr_ino_tâ
/usr/include/apr-1/apr_file_info.h:141: error: storage class specified for parameter âapr_dev_tâ
/usr/include/apr-1/apr_file_info.h:149: error: storage class specified for parameter âapr_finfo_tâ
/usr/include/apr-1/apr_file_info.h:182: error: expected specifier-qualifier-list before âapr_pool_tâ
/usr/include/apr-1/apr_file_info.h:219: warning: empty declaration
/usr/include/apr-1/apr_file_info.h:235: error: expected declaration specifiers before âAPR_DECLAREâ
/usr/include/apr-1/apr_file_info.h:250: error: expected declaration specifiers before âAPR_DECLAREâ
/usr/include/apr-1/apr_file_info.h:258: error: expected declaration specifiers before âAPR_DECLAREâ
/usr/include/apr-1/apr_file_info.h:272: error: expected declaration specifiers before âAPR_DECLAREâ
/usr/include/apr-1/apr_file_info.h:279: error: expected declaration specifiers before âAPR_DECLAREâ
/usr/include/apr-1/apr_file_info.h:337: error: expected declaration specifiers before âAPR_DECLAREâ
/usr/include/apr-1/apr_file_info.h:355: error: expected declaration specifiers before âAPR_DECLAREâ
/usr/include/apr-1/apr_file_info.h:370: error: expected declaration specifiers before âAPR_DECLAREâ
/usr/include/apr-1/apr_file_info.h:383: error: expected declaration specifiers before âAPR_DECLAREâ
/usr/include/apr-1/apr_file_info.h:394: error: expected declaration specifiers before âAPR_DECLAREâ
/usr/include/apr-1/apr_file_info.h:402: error: expected declaration specifiers before âAPR_DECLAREâ
/usr/include/apr-1/apr_file_info.h:420: error: expected declaration specifiers before âAPR_DECLAREâ
In file included from /usr/include/apr-1/apr_network_io.h:26,
from /usr/include/httpd/httpd.h:53,
from mod_ruby.h:52,
from mod_ruby.c:33:
/usr/include/apr-1/apr_file_io.h:151: error: expected â=â, â,â, â;â, âasmâ or â__attribute__â before âapr_fileattrs_tâ
/usr/include/apr-1/apr_file_io.h:154: error: storage class specified for parameter âapr_seek_where_tâ
/usr/include/apr-1/apr_file_io.h:159: error: storage class specified for parameter âapr_file_tâ
/usr/include/apr-1/apr_file_io.h:217: error: expected declaration specifiers before âAPR_DECLAREâ
/usr/include/apr-1/apr_file_io.h:225: error: expected declaration specifiers before âAPR_DECLAREâ
/usr/include/apr-1/apr_file_io.h:234: error: expected declaration specifiers before âAPR_DECLAREâ
/usr/include/apr-1/apr_file_io.h:245: error: expected declaration specifiers before âAPR_DECLAREâ
/usr/include/apr-1/apr_file_io.h:261: error: expected declaration specifiers before âAPR_DECLAREâ
/usr/include/apr-1/apr_file_io.h:277: error: expected declaration specifiers before âAPR_DECLAREâ
/usr/include/apr-1/apr_file_io.h:287: error: expected declaration specifiers before âAPR_DECLAREâ
/usr/include/apr-1/apr_file_io.h:304: error: expected declaration specifiers before âAPR_DECLAREâ
/usr/include/apr-1/apr_file_io.h:314: error: expected declaration specifiers before âAPR_DECLAREâ
/usr/include/apr-1/apr_file_io.h:324: error: expected declaration specifiers before âAPR_DECLAREâ
/usr/include/apr-1/apr_file_io.h:344: error: expected declaration specifiers before âAPR_DECLAREâ
/usr/include/apr-1/apr_file_io.h:362: error: expected declaration specifiers before âAPR_DECLAREâ
/usr/include/apr-1/apr_file_io.h:380: error: expected declaration specifiers before âAPR_DECLAREâ
/usr/include/apr-1/apr_file_io.h:404: error: expected declaration specifiers before âAPR_DECLAREâ
/usr/include/apr-1/apr_file_io.h:428: error: expected declaration specifiers before âAPR_DECLAREâ
/usr/include/apr-1/apr_file_io.h:447: error: expected declaration specifiers before âAPR_DECLAREâ
/usr/include/apr-1/apr_file_io.h:456: error: expected declaration specifiers before âAPR_DECLAREâ
/usr/include/apr-1/apr_file_io.h:463: error: expected declaration specifiers before âAPR_DECLAREâ
/usr/include/apr-1/apr_file_io.h:470: error: expected declaration specifiers before âAPR_DECLAREâ
/usr/include/apr-1/apr_file_io.h:479: error: expected declaration specifiers before âAPR_DECLAREâ
/usr/include/apr-1/apr_file_io.h:487: error: expected declaration specifiers before âAPR_DECLAREâ
/usr/include/apr-1/apr_file_io.h:493: error: expected declaration specifiers before âAPR_DECLAREâ
/usr/include/apr-1/apr_file_io.h:502: error: expected declaration specifiers before âAPR_DECLAREâ
/usr/include/apr-1/apr_file_io.h:514: error: expected declaration specifiers before âAPR_DECLAREâ
/usr/include/apr-1/apr_file_io.h:529: error: expected declaration specifiers before âAPR_DECLAREâ
/usr/include/apr-1/apr_file_io.h:546: error: expected declaration specifiers before âAPR_DECLAREâ
/usr/include/apr-1/apr_file_io.h:556: error: expected declaration specifiers before âAPR_DECLAREâ
/usr/include/apr-1/apr_file_io.h:566: error: expected declaration specifiers before âAPR_DECLAREâ
/usr/include/apr-1/apr_file_io.h:575: error: expected declaration specifiers before âAPR_DECLAREâ
/usr/include/apr-1/apr_file_io.h:584: error: expected declaration specifiers before âAPR_DECLAREâ
/usr/include/apr-1/apr_file_io.h:598: error: expected declaration specifiers before âAPR_DECLAREâ
/usr/include/apr-1/apr_file_io.h:604: error: expected declaration specifiers before âAPR_DECLAREâ
/usr/include/apr-1/apr_file_io.h:613: error: expected declaration specifiers before âAPR_DECLAREâ
/usr/include/apr-1/apr_file_io.h:622: error: expected declaration specifiers before âAPR_DECLAREâ
/usr/include/apr-1/apr_file_io.h:632: error: expected declaration specifiers before âAPR_DECLAREâ
/usr/include/apr-1/apr_file_io.h:643: error: expected declaration specifiers before âAPR_DECLARE_NONSTDâ
/usr/include/apr-1/apr_file_io.h:659: error: expected declaration specifiers before âAPR_DECLAREâ
/usr/include/apr-1/apr_file_io.h:680: error: expected declaration specifiers before âAPR_DECLAREâ
/usr/include/apr-1/apr_file_io.h:693: error: expected declaration specifiers before âAPR_DECLAREâ
/usr/include/apr-1/apr_file_io.h:703: error: expected declaration specifiers before âAPR_DECLAREâ
/usr/include/apr-1/apr_file_io.h:713: error: expected declaration specifiers before âAPR_DECLAREâ
/usr/include/apr-1/apr_file_io.h:722: error: expected declaration specifiers before âAPR_DECLAREâ
/usr/include/apr-1/apr_file_io.h:730: error: expected declaration specifiers before âAPR_DECLAREâ
/usr/include/apr-1/apr_file_io.h:740: error: expected declaration specifiers before âAPR_DECLAREâ
/usr/include/apr-1/apr_file_io.h:747: error: expected declaration specifiers before âAPR_DECLAREâ
/usr/include/apr-1/apr_file_io.h:752: error: expected declaration specifiers before âAPR_DECLAREâ
/usr/include/apr-1/apr_file_io.h:758: error: expected declaration specifiers before âAPR_DECLAREâ
/usr/include/apr-1/apr_file_io.h:763: error: expected declaration specifiers before âAPR_DECLAREâ
/usr/include/apr-1/apr_file_io.h:781: error: expected declaration specifiers before âAPR_DECLAREâ
/usr/include/apr-1/apr_file_io.h:797: error: expected declaration specifiers before âAPR_DECLAREâ
In file included from /usr/include/httpd/httpd.h:53,
from mod_ruby.h:52,
from mod_ruby.c:33:
/usr/include/apr-1/apr_network_io.h:110: error: storage class specified for parameter âapr_shutdown_how_eâ
/usr/include/apr-1/apr_network_io.h:121: error: expected specifier-qualifier-list before âapr_uint32_tâ
/usr/include/apr-1/apr_network_io.h:122: warning: empty declaration
/usr/include/apr-1/apr_network_io.h:172: error: storage class specified for parameter âapr_interface_eâ
/usr/include/apr-1/apr_network_io.h:190: error: storage class specified for parameter âapr_socket_tâ
/usr/include/apr-1/apr_network_io.h:194: error: storage class specified for parameter âapr_hdtr_tâ
/usr/include/apr-1/apr_network_io.h:196: error: storage class specified for parameter âapr_in_addr_tâ
/usr/include/apr-1/apr_network_io.h:198: error: storage class specified for parameter âapr_ipsubnet_tâ
/usr/include/apr-1/apr_network_io.h:201: error: expected â=â, â,â, â;â, âasmâ or â__attribute__â before âapr_port_tâ
/usr/include/apr-1/apr_network_io.h:206: error: storage class specified for parameter âapr_sockaddr_tâ
/usr/include/apr-1/apr_network_io.h:212: error: expected specifier-qualifier-list before âapr_pool_tâ
/usr/include/apr-1/apr_network_io.h:248: warning: empty declaration
/usr/include/apr-1/apr_network_io.h:269: warning: empty declaration
/usr/include/apr-1/apr_network_io.h:281: error: expected declaration specifiers before âAPR_DECLAREâ
/usr/include/apr-1/apr_network_io.h:299: error: expected declaration specifiers before âAPR_DECLAREâ
/usr/include/apr-1/apr_network_io.h:306: error: expected declaration specifiers before âAPR_DECLAREâ
/usr/include/apr-1/apr_network_io.h:315: error: expected declaration specifiers before âAPR_DECLAREâ
/usr/include/apr-1/apr_network_io.h:325: error: expected declaration specifiers before âAPR_DECLAREâ
/usr/include/apr-1/apr_network_io.h:336: error: expected declaration specifiers before âAPR_DECLAREâ
/usr/include/apr-1/apr_network_io.h:346: error: expected declaration specifiers before âAPR_DECLAREâ
/usr/include/apr-1/apr_network_io.h:372: error: expected declaration specifiers before âAPR_DECLAREâ
/usr/include/apr-1/apr_network_io.h:385: error: expected declaration specifiers before âAPR_DECLAREâ
/usr/include/apr-1/apr_network_io.h:419: error: expected declaration specifiers before âAPR_DECLAREâ
/usr/include/apr-1/apr_network_io.h:433: error: expected declaration specifiers before âAPR_DECLAREâ
/usr/include/apr-1/apr_network_io.h:441: error: expected declaration specifiers before âAPR_DECLAREâ
/usr/include/apr-1/apr_network_io.h:451: error: expected declaration specifiers before âAPR_DECLAREâ
/usr/include/apr-1/apr_network_io.h:472: error: expected declaration specifiers before âAPR_DECLAREâ
/usr/include/apr-1/apr_network_io.h:493: error: expected declaration specifiers before âAPR_DECLAREâ
/usr/include/apr-1/apr_network_io.h:504: error: expected declaration specifiers before âAPR_DECLAREâ
/usr/include/apr-1/apr_network_io.h:517: error: expected declaration specifiers before âAPR_DECLAREâ
/usr/include/apr-1/apr_network_io.h:570: error: expected declaration specifiers before âAPR_DECLAREâ
/usr/include/apr-1/apr_network_io.h:595: error: expected declaration specifiers before âAPR_DECLAREâ
/usr/include/apr-1/apr_network_io.h:609: error: expected declaration specifiers before âAPR_DECLAREâ
/usr/include/apr-1/apr_network_io.h:631: error: expected declaration specifiers before âAPR_DECLAREâ
/usr/include/apr-1/apr_network_io.h:639: error: expected declaration specifiers before âAPR_DECLAREâ
/usr/include/apr-1/apr_network_io.h:648: error: expected declaration specifiers before âAPR_DECLAREâ
/usr/include/apr-1/apr_network_io.h:657: error: expected declaration specifiers before âAPR_DECLAREâ
/usr/include/apr-1/apr_network_io.h:668: error: expected declaration specifiers before âAPR_DECLAREâ
/usr/include/apr-1/apr_network_io.h:681: error: expected declaration specifiers before âAPR_DECLAREâ
/usr/include/apr-1/apr_network_io.h:689: error: expected declaration specifiers before âAPR_DECLAREâ
/usr/include/apr-1/apr_network_io.h:697: error: expected declaration specifiers before âAPR_DECLAREâ
/usr/include/apr-1/apr_network_io.h:707: error: expected declaration specifiers before âAPR_DECLAREâ
/usr/include/apr-1/apr_network_io.h:719: error: expected declaration specifiers before âAPR_DECLAREâ
/usr/include/apr-1/apr_network_io.h:738: error: expected declaration specifiers before âAPR_DECLAREâ
/usr/include/apr-1/apr_network_io.h:744: error: expected declaration specifiers before âAPR_DECLAREâ
/usr/include/apr-1/apr_network_io.h:749: error: expected declaration specifiers before âAPR_DECLAREâ
/usr/include/apr-1/apr_network_io.h:754: error: expected declaration specifiers before âAPR_DECLAREâ
/usr/include/apr-1/apr_network_io.h:770: error: expected declaration specifiers before âAPR_DECLAREâ
/usr/include/apr-1/apr_network_io.h:785: error: expected declaration specifiers before âAPR_DECLAREâ
/usr/include/apr-1/apr_network_io.h:797: error: expected declaration specifiers before âAPR_DECLAREâ
/usr/include/apr-1/apr_network_io.h:805: error: expected declaration specifiers before âAPR_DECLAREâ
/usr/include/apr-1/apr_network_io.h:814: error: expected declaration specifiers before âAPR_DECLAREâ
In file included from /usr/include/apr-1/apr_buckets.h:32,
from /usr/include/httpd/httpd.h:54,
from mod_ruby.h:52,
from mod_ruby.c:33:
/usr/include/apr-1/apr_mmap.h:51: error: storage class specified for parameter âapr_mmap_tâ
/usr/include/apr-1/apr_mmap.h:64: error: expected specifier-qualifier-list before âapr_pool_tâ
/usr/include/apr-1/apr_mmap.h:86: warning: empty declaration
In file included from /usr/include/httpd/httpd.h:54,
from mod_ruby.h:52,
from mod_ruby.c:33:
/usr/include/apr-1/apr_buckets.h:60: error: storage class specified for parameter âapr_read_type_eâ
/usr/include/apr-1/apr_buckets.h:119: error: storage class specified for parameter âapr_bucket_brigadeâ
/usr/include/apr-1/apr_buckets.h:121: error: storage class specified for parameter âapr_bucketâ
/usr/include/apr-1/apr_buckets.h:123: error: storage class specified for parameter âapr_bucket_alloc_tâ
/usr/include/apr-1/apr_buckets.h:126: error: storage class specified for parameter âapr_bucket_type_tâ
/usr/include/apr-1/apr_buckets.h:176: error: expected â)â before â*â token
/usr/include/apr-1/apr_buckets.h:192: error: expected â;â before âapr_status_tâ
/usr/include/apr-1/apr_buckets.h:213: warning: empty declaration
/usr/include/apr-1/apr_buckets.h:228: error: expected â:â, â,â, â;â, â}â or â__attribute__â before â*â token
/usr/include/apr-1/apr_buckets.h:255: warning: empty declaration
/usr/include/apr-1/apr_buckets.h:264: error: expected specifier-qualifier-list before âapr_pool_tâ
/usr/include/apr-1/apr_buckets.h:276: warning: empty declaration
/usr/include/apr-1/apr_buckets.h:282: error: expected â)â before â*â token
/usr/include/apr-1/apr_buckets.h:524: error: storage class specified for parameter âapr_bucket_refcountâ
/usr/include/apr-1/apr_buckets.h:534: warning: empty declaration
/usr/include/apr-1/apr_buckets.h:539: error: storage class specified for parameter âapr_bucket_heapâ
/usr/include/apr-1/apr_buckets.h:545: error: expected specifier-qualifier-list before âapr_bucket_refcountâ
/usr/include/apr-1/apr_buckets.h:554: warning: empty declaration
/usr/include/apr-1/apr_buckets.h:557: error: storage class specified for parameter âapr_bucket_poolâ
/usr/include/apr-1/apr_buckets.h:573: error: expected specifier-qualifier-list before âapr_bucket_heapâ
/usr/include/apr-1/apr_buckets.h:591: warning: empty declaration
/usr/include/apr-1/apr_buckets.h:608: error: storage class specified for parameter âapr_bucket_fileâ
/usr/include/apr-1/apr_buckets.h:614: error: expected specifier-qualifier-list before âapr_bucket_refcountâ
/usr/include/apr-1/apr_buckets.h:625: warning: empty declaration
/usr/include/apr-1/apr_buckets.h:628: error: storage class specified for parameter âapr_bucket_structsâ
/usr/include/apr-1/apr_buckets.h:634: error: expected specifier-qualifier-list before âapr_bucketâ
/usr/include/apr-1/apr_buckets.h:641: warning: empty declaration
/usr/include/apr-1/apr_buckets.h:658: error: expected declaration specifiers before âapr_bucket_brigadeâ
/usr/include/apr-1/apr_buckets.h:666: error: expected â)â before â*â token
/usr/include/apr-1/apr_buckets.h:690: error: expected declaration specifiers before âapr_bucket_brigadeâ
/usr/include/apr-1/apr_buckets.h:705: error: expected â)â before â*â token
/usr/include/apr-1/apr_buckets.h:716: error: expected â)â before â*â token
/usr/include/apr-1/apr_buckets.h:727: error: expected â)â before â*â token
/usr/include/apr-1/apr_buckets.h:738: error: expected â)â before â*â token
/usr/include/apr-1/apr_buckets.h:751: error: expected â)â before â*â token
/usr/include/apr-1/apr_buckets.h:765: error: expected â)â before â*â token
/usr/include/apr-1/apr_buckets.h:776: error: expected â)â before â*â token
/usr/include/apr-1/apr_buckets.h:790: error: expected â)â before â*â token
/usr/include/apr-1/apr_buckets.h:803: error: expected â)â before â*â token
/usr/include/apr-1/apr_buckets.h:817: error: expected â)â before â*â token
/usr/include/apr-1/apr_buckets.h:829: error: expected â)â before â*â token
/usr/include/apr-1/apr_buckets.h:841: error: expected â)â before â*â token
/usr/include/apr-1/apr_buckets.h:855: error: expected â)â before â*â token
/usr/include/apr-1/apr_buckets.h:871: error: expected â)â before â*â token
/usr/include/apr-1/apr_buckets.h:888: error: expected declaration specifiers before âapr_bucketâ
/usr/include/apr-1/apr_buckets.h:910: error: expected declaration specifiers before âapr_bucket_alloc_tâ
/usr/include/apr-1/apr_buckets.h:920: error: expected declaration specifiers before âapr_bucket_alloc_tâ
/usr/include/apr-1/apr_buckets.h:926: error: expected â)â before â*â token
/usr/include/apr-1/apr_buckets.h:933: error: expected â)â before âsizeâ
/usr/include/apr-1/apr_buckets.h:1012: error: expected â)â before â*â token
/usr/include/apr-1/apr_buckets.h:1022: error: expected â)â before â*â token
/usr/include/apr-1/apr_buckets.h:1032: error: expected â)â before â*â token
/usr/include/apr-1/apr_buckets.h:1042: error: expected â)â before â*â token
/usr/include/apr-1/apr_buckets.h:1071: error: expected â=â, â,â, â;â, âasmâ or â__attribute__â before âapr_bucket_type_flushâ
/usr/include/apr-1/apr_buckets.h:1077: error: expected â=â, â,â, â;â, âasmâ or â__attribute__â before âapr_bucket_type_eosâ
/usr/include/apr-1/apr_buckets.h:1081: error: expected â=â, â,â, â;â, âasmâ or â__attribute__â before âapr_bucket_type_fileâ
/usr/include/apr-1/apr_buckets.h:1086: error: expected â=â, â,â, â;â, âasmâ or â__attribute__â before âapr_bucket_type_heapâ
/usr/include/apr-1/apr_buckets.h:1098: error: expected â=â, â,â, â;â, âasmâ or â__attribute__â before âapr_bucket_type_poolâ
/usr/include/apr-1/apr_buckets.h:1102: error: expected â=â, â,â, â;â, âasmâ or â__attribute__â before âapr_bucket_type_pipeâ
/usr/include/apr-1/apr_buckets.h:1108: error: expected â=â, â,â, â;â, âasmâ or â__attribute__â before âapr_bucket_type_immortalâ
/usr/include/apr-1/apr_buckets.h:1114: error: expected â=â, â,â, â;â, âasmâ or â__attribute__â before âapr_bucket_type_transientâ
/usr/include/apr-1/apr_buckets.h:1118: error: expected â=â, â,â, â;â, âasmâ or â__attribute__â before âapr_bucket_type_socketâ
/usr/include/apr-1/apr_buckets.h:1134: error: expected â)â before â*â token
/usr/include/apr-1/apr_buckets.h:1147: error: expected â)â before â*â token
/usr/include/apr-1/apr_buckets.h:1167: error: expected declaration specifiers before âapr_bucketâ
/usr/include/apr-1/apr_buckets.h:1192: error: expected â)â before â*â token
/usr/include/apr-1/apr_buckets.h:1204: error: expected â)â before â*â token
/usr/include/apr-1/apr_buckets.h:1226: error: expected declaration specifiers before âapr_bucketâ
/usr/include/apr-1/apr_buckets.h:1235: error: expected declaration specifiers before âapr_bucketâ
/usr/include/apr-1/apr_buckets.h:1244: error: expected declaration specifiers before âapr_bucketâ
/usr/include/apr-1/apr_buckets.h:1253: error: expected declaration specifiers before âapr_bucketâ
/usr/include/apr-1/apr_buckets.h:1262: error: expected declaration specifiers before âapr_bucketâ
/usr/include/apr-1/apr_buckets.h:1273: error: expected declaration specifiers before âapr_bucketâ
/usr/include/apr-1/apr_buckets.h:1284: error: expected declaration specifiers before âapr_bucketâ
/usr/include/apr-1/apr_buckets.h:1295: error: expected declaration specifiers before âapr_bucketâ
/usr/include/apr-1/apr_buckets.h:1313: error: expected declaration specifiers before âapr_bucketâ
/usr/include/apr-1/apr_buckets.h:1326: error: expected declaration specifiers before âapr_bucketâ
/usr/include/apr-1/apr_buckets.h:1339: error: expected declaration specifiers before âapr_bucketâ
/usr/include/apr-1/apr_buckets.h:1352: error: expected declaration specifiers before âapr_bucketâ
/usr/include/apr-1/apr_buckets.h:1391: error: expected declaration specifiers before âapr_bucketâ
/usr/include/apr-1/apr_buckets.h:1399: error: expected declaration specifiers before âapr_bucketâ
/usr/include/apr-1/apr_buckets.h:1408: error: expected declaration specifiers before âapr_bucketâ
/usr/include/apr-1/apr_buckets.h:1417: error: expected declaration specifiers before âapr_bucketâ
/usr/include/apr-1/apr_buckets.h:1430: error: expected declaration specifiers before âapr_bucketâ
/usr/include/apr-1/apr_buckets.h:1446: error: expected declaration specifiers before âapr_bucketâ
/usr/include/apr-1/apr_buckets.h:1456: error: expected â)â before â*â token
In file included from /usr/include/httpd/httpd.h:55,
from mod_ruby.h:52,
from mod_ruby.c:33:
/usr/include/apr-1/apr_poll.h:65: error: storage class specified for parameter âapr_datatype_eâ
/usr/include/apr-1/apr_poll.h:69: error: expected specifier-qualifier-list before âapr_file_tâ
/usr/include/apr-1/apr_poll.h:71: error: storage class specified for parameter âapr_descriptorâ
/usr/include/apr-1/apr_poll.h:74: error: storage class specified for parameter âapr_pollfd_tâ
/usr/include/apr-1/apr_poll.h:78: error: expected specifier-qualifier-list before âapr_pool_tâ
/usr/include/apr-1/apr_poll.h:84: warning: empty declaration
/usr/include/apr-1/apr_poll.h:92: error: storage class specified for parameter âapr_pollset_tâ
/usr/include/apr-1/apr_poll.h:108: error: expected declaration specifiers before âAPR_DECLAREâ
/usr/include/apr-1/apr_poll.h:117: error: expected declaration specifiers before âAPR_DECLAREâ
/usr/include/apr-1/apr_poll.h:136: error: expected declaration specifiers before âAPR_DECLAREâ
/usr/include/apr-1/apr_poll.h:153: error: expected declaration specifiers before âAPR_DECLAREâ
/usr/include/apr-1/apr_poll.h:163: error: expected declaration specifiers before âAPR_DECLAREâ
/usr/include/apr-1/apr_poll.h:184: error: expected declaration specifiers before âAPR_DECLAREâ
In file included from /usr/include/httpd/httpd.h:59,
from mod_ruby.h:52,
from mod_ruby.c:33:
/usr/include/httpd/ap_regex.h:82: warning: empty declaration
/usr/include/httpd/ap_regex.h:87: error: expected specifier-qualifier-list before âapr_size_tâ
/usr/include/httpd/ap_regex.h:89: error: storage class specified for parameter âap_regex_tâ
/usr/include/httpd/ap_regex.h:95: error: storage class specified for parameter âap_regmatch_tâ
/usr/include/httpd/ap_regex.h:106: error: expected â)â before â*â token
/usr/include/httpd/ap_regex.h:117: warning: type defaults to âintâ in declaration of âap_regex_tâ
/usr/include/httpd/ap_regex.h:117: error: expected â;â, â,â or â)â before â*â token
/usr/include/httpd/ap_regex.h:127: error: expected declaration specifiers before âapr_size_tâ
/usr/include/httpd/ap_regex.h:133: error: expected â)â before â*â token
In file included from mod_ruby.h:52,
from mod_ruby.c:33:
/usr/include/httpd/httpd.h:412: error: storage class specified for parameter âap_version_tâ
/usr/include/httpd/httpd.h:420: error: expected â)â before â*â token
/usr/include/httpd/httpd.h:433: error: expected â)â before â*â token
/usr/include/httpd/httpd.h:590: error: storage class specified for parameter âap_method_list_tâ
/usr/include/httpd/httpd.h:601: error: expected specifier-qualifier-list before âapr_int64_tâ
/usr/include/httpd/httpd.h:604: warning: empty declaration
/usr/include/httpd/httpd.h:700: warning: empty declaration
/usr/include/httpd/httpd.h:711: error: storage class specified for parameter âprocess_recâ
/usr/include/httpd/httpd.h:713: error: storage class specified for parameter âserver_recâ
/usr/include/httpd/httpd.h:715: error: storage class specified for parameter âconn_recâ
/usr/include/httpd/httpd.h:717: error: storage class specified for parameter ârequest_recâ
/usr/include/httpd/httpd.h:719: error: storage class specified for parameter âconn_state_tâ
In file included from /usr/include/httpd/httpd.h:723,
from mod_ruby.h:52,
from mod_ruby.c:33:
/usr/include/apr-1/apr_uri.h:80: error: storage class specified for parameter âapr_uri_tâ
/usr/include/apr-1/apr_uri.h:109: error: expected specifier-qualifier-list before âapr_port_tâ
/usr/include/apr-1/apr_uri.h:118: warning: empty declaration
/usr/include/apr-1/apr_uri.h:127: error: expected declaration specifiers before âapr_port_tâ
/usr/include/apr-1/apr_uri.h:146: error: expected â)â before â*â token
/usr/include/apr-1/apr_uri.h:159: error: expected â)â before â*â token
/usr/include/apr-1/apr_uri.h:169: error: expected â)â before â*â token
In file included from mod_ruby.h:52,
from mod_ruby.c:33:
/usr/include/httpd/httpd.h:730: error: expected specifier-qualifier-list before âapr_pool_tâ
/usr/include/httpd/httpd.h:739: warning: empty declaration
/usr/include/httpd/httpd.h:746: error: expected specifier-qualifier-list before âapr_pool_tâ
/usr/include/httpd/httpd.h:975: warning: empty declaration
/usr/include/httpd/httpd.h:1001: error: storage class specified for parameter âap_conn_keepalive_eâ
/usr/include/httpd/httpd.h:1008: error: expected specifier-qualifier-list before âapr_pool_tâ
/usr/include/httpd/httpd.h:1069: warning: empty declaration
/usr/include/httpd/httpd.h:1078: error: storage class specified for parameter âconn_state_eâ
/usr/include/httpd/httpd.h:1087: error: expected specifier-qualifier-list before âapr_time_tâ
/usr/include/httpd/httpd.h:1098: warning: empty declaration
/usr/include/httpd/httpd.h:1113: error: storage class specified for parameter âserver_addr_recâ
/usr/include/httpd/httpd.h:1116: error: expected specifier-qualifier-list before âserver_addr_recâ
/usr/include/httpd/httpd.h:1123: warning: empty declaration
/usr/include/httpd/httpd.h:1130: error: expected specifier-qualifier-list before âprocess_recâ
/usr/include/httpd/httpd.h:1199: warning: empty declaration
/usr/include/httpd/httpd.h:1202: error: expected specifier-qualifier-list before âapr_bucket_brigadeâ
/usr/include/httpd/httpd.h:1207: error: storage class specified for parameter âcore_output_filter_ctx_tâ
/usr/include/httpd/httpd.h:1210: error: expected specifier-qualifier-list before âapr_bucket_brigadeâ
/usr/include/httpd/httpd.h:1212: error: storage class specified for parameter âcore_ctx_tâ
/usr/include/httpd/httpd.h:1216: error: expected specifier-qualifier-list before âapr_socket_tâ
/usr/include/httpd/httpd.h:1223: error: storage class specified for parameter âcore_net_recâ
/usr/include/httpd/httpd.h:1232: error: expected â)â before â*â token
/usr/include/httpd/httpd.h:1242: error: expected â)â before â*â token
/usr/include/httpd/httpd.h:1255: error: expected â)â before â*â token
/usr/include/httpd/httpd.h:1265: error: expected â)â before â*â token
/usr/include/httpd/httpd.h:1274: error: expected â)â before â*â token
/usr/include/httpd/httpd.h:1284: error: expected â)â before â*â token
/usr/include/httpd/httpd.h:1294: error: expected â)â before â*â token
/usr/include/httpd/httpd.h:1306: error: expected â)â before â*â token
/usr/include/httpd/httpd.h:1314: error: expected â)â before â*â token
/usr/include/httpd/httpd.h:1323: error: expected â)â before â*â token
/usr/include/httpd/httpd.h:1334: error: expected â)â before â*â token
/usr/include/httpd/httpd.h:1357: error: expected â)â before â*â token
/usr/include/httpd/httpd.h:1367: error: expected â)â before â*â token
/usr/include/httpd/httpd.h:1379: error: expected â)â before â*â token
/usr/include/httpd/httpd.h:1388: error: expected â)â before â*â token
/usr/include/httpd/httpd.h:1397: error: expected â)â before â*â token
/usr/include/httpd/httpd.h:1439: error: expected â)â before â*â token
/usr/include/httpd/httpd.h:1449: error: expected â)â before â*â token
/usr/include/httpd/httpd.h:1460: error: expected â)â before â*â token
/usr/include/httpd/httpd.h:1468: error: expected â)â before â*â token
/usr/include/httpd/httpd.h:1477: error: expected declaration specifiers before âapr_size_tâ
/usr/include/httpd/httpd.h:1488: error: expected â)â before â*â token
/usr/include/httpd/httpd.h:1497: error: expected â)â before â*â token
/usr/include/httpd/httpd.h:1526: error: expected â)â before â*â token
/usr/include/httpd/httpd.h:1540: error: expected â)â before â*â token
/usr/include/httpd/httpd.h:1550: error: expected â)â before â*â token
/usr/include/httpd/httpd.h:1602: error: expected â)â before â*â token
/usr/include/httpd/httpd.h:1610: error: expected â)â before â*â token
/usr/include/httpd/httpd.h:1624: error: expected declaration specifiers before âap_regex_tâ
/usr/include/httpd/httpd.h:1632: error: expected â)â before â*â token
/usr/include/httpd/httpd.h:1645: error: expected â)â before â*â token
/usr/include/httpd/httpd.h:1685: error: expected â)â before â*â token
/usr/include/httpd/httpd.h:1697: error: expected â)â before â*â token
/usr/include/httpd/httpd.h:1707: error: expected â)â before â*â token
/usr/include/httpd/httpd.h:1715: error: expected â)â before â*â token
/usr/include/httpd/httpd.h:1726: error: expected â)â before â*â token
/usr/include/httpd/httpd.h:1790: error: expected declaration specifiers or â...â before ârequest_recâ
In file included from /usr/include/httpd/http_config.h:30,
from mod_ruby.h:53,
from mod_ruby.c:33:
/usr/include/httpd/util_cfgtree.h:31: error: storage class specified for parameter âap_directive_tâ
/usr/include/httpd/util_cfgtree.h:66: warning: empty declaration
/usr/include/httpd/util_cfgtree.h:72: error: expected â=â, â,â, â;â, âasmâ or â__attribute__â before â*â token
/usr/include/httpd/util_cfgtree.h:83: error: expected declaration specifiers before âap_directive_tâ
In file included from mod_ruby.h:53,
from mod_ruby.c:33:
/usr/include/httpd/http_config.h:66: warning: empty declaration
/usr/include/httpd/http_config.h:72: error: storage class specified for parameter âcmd_parmsâ
/usr/include/httpd/http_config.h:82: error: expected â)â before â*â token
/usr/include/httpd/http_config.h:84: error: expected â;â before âconstâ
/usr/include/httpd/http_config.h:99: error: storage class specified for parameter âcmd_funcâ
/usr/include/httpd/http_config.h:201: error: storage class specified for parameter âcommand_recâ
/usr/include/httpd/http_config.h:206: error: expected specifier-qualifier-list before âcmd_funcâ
/usr/include/httpd/http_config.h:217: warning: empty declaration
/usr/include/httpd/http_config.h:257: error: storage class specified for parameter âap_configfile_tâ
/usr/include/httpd/http_config.h:266: warning: empty declaration
/usr/include/httpd/http_config.h:279: error: expected specifier-qualifier-list before âapr_int64_tâ
/usr/include/httpd/http_config.h:314: warning: empty declaration
/usr/include/httpd/http_config.h:321: error: storage class specified for parameter âmoduleâ
/usr/include/httpd/http_config.h:350: error: expected â)â before â*â token
/usr/include/httpd/http_config.h:357: error: expected â;â before âvoidâ
/usr/include/httpd/http_config.h:394: warning: empty declaration
/usr/include/httpd/http_config.h:437: error: storage class specified for parameter âap_conf_vector_tâ
/usr/include/httpd/http_config.h:447: warning: type defaults to âintâ in declaration of âap_conf_vector_tâ
/usr/include/httpd/http_config.h:447: error: expected â;â, â,â or â)â before â*â token
/usr/include/httpd/http_config.h:458: error: expected â)â before â*â token
/usr/include/httpd/http_config.h:478: error: expected â)â before â*â token
/usr/include/httpd/http_config.h:489: error: expected â)â before â*â token
/usr/include/httpd/http_config.h:503: error: expected â)â before â*â token
/usr/include/httpd/http_config.h:513: error: expected â)â before â*â token
/usr/include/httpd/http_config.h:523: error: expected â)â before â*â token
/usr/include/httpd/http_config.h:533: error: expected â)â before â*â token
/usr/include/httpd/http_config.h:548: error: expected â)â before â*â token
/usr/include/httpd/http_config.h:557: error: expected â)â before â*â token
/usr/include/httpd/http_config.h:566: error: expected â)â before â*â token
/usr/include/httpd/http_config.h:576: error: expected â)â before â*â token
/usr/include/httpd/http_config.h:582: error: expected â)â before â*â token
/usr/include/httpd/http_config.h:587: error: expected â)â before â*â token
/usr/include/httpd/http_config.h:593: error: expected â)â before â*â token
/usr/include/httpd/http_config.h:599: error: expected declaration specifiers before âmoduleâ
/usr/include/httpd/http_config.h:607: error: expected â)â before â*â token
/usr/include/httpd/http_config.h:619: error: expected declaration specifiers before âap_configfile_tâ
/usr/include/httpd/http_config.h:633: error: expected declaration specifiers or â...â before âap_configfile_tâ
/usr/include/httpd/http_config.h:640: error: expected â)â before â*â token
/usr/include/httpd/http_config.h:647: error: expected â)â before â*â token
/usr/include/httpd/http_config.h:656: error: expected â)â before â*â token
/usr/include/httpd/http_config.h:669: error: expected â)â before â*â token
/usr/include/httpd/http_config.h:684: error: expected â)â before â*â token
/usr/include/httpd/http_config.h:696: error: expected â)â before â*â token
/usr/include/httpd/http_config.h:710: error: expected â)â before â*â token
/usr/include/httpd/http_config.h:975: error: expected â)â before â*â token
/usr/include/httpd/http_config.h:975: error: expected â)â before â*â token
/usr/include/httpd/http_config.h:975: error: expected â)â before â*â token
/usr/include/httpd/http_config.h:975: error: expected declaration specifiers before âapr_array_header_tâ
/usr/include/httpd/http_config.h:975: error: expected specifier-qualifier-list before âap_HOOK_header_parser_tâ
/usr/include/httpd/http_config.h:975: error: storage class specified for parameter âap_LINK_header_parser_tâ
/usr/include/httpd/http_config.h:984: error: expected â)â before â*â token
/usr/include/httpd/http_config.h:984: error: expected â)â before â*â token
/usr/include/httpd/http_config.h:984: error: expected â)â before â*â token
/usr/include/httpd/http_config.h:984: error: expected declaration specifiers before âapr_array_header_tâ
/usr/include/httpd/http_config.h:984: error: expected specifier-qualifier-list before âap_HOOK_pre_config_tâ
/usr/include/httpd/http_config.h:984: error: storage class specified for parameter âap_LINK_pre_config_tâ
/usr/include/httpd/http_config.h:993: error: expected â)â before â*â token
/usr/include/httpd/http_config.h:993: error: expected â)â before â*â token
/usr/include/httpd/http_config.h:993: error: expected â)â before â*â token
/usr/include/httpd/http_config.h:993: error: expected declaration specifiers before âapr_array_header_tâ
/usr/include/httpd/http_config.h:993: error: expected specifier-qualifier-list before âap_HOOK_test_config_tâ
/usr/include/httpd/http_config.h:993: error: storage class specified for parameter âap_LINK_test_config_tâ
/usr/include/httpd/http_config.h:1003: error: expected â)â before â*â token
/usr/include/httpd/http_config.h:1003: error: expected â)â before â*â token
/usr/include/httpd/http_config.h:1003: error: expected â)â before â*â token
/usr/include/httpd/http_config.h:1003: error: expected declaration specifiers before âapr_array_header_tâ
/usr/include/httpd/http_config.h:1003: error: expected specifier-qualifier-list before âap_HOOK_post_config_tâ
/usr/include/httpd/http_config.h:1003: error: storage class specified for parameter âap_LINK_post_config_tâ
/usr/include/httpd/http_config.h:1014: error: expected â)â before â*â token
/usr/include/httpd/http_config.h:1014: error: expected â)â before â*â token
/usr/include/httpd/http_config.h:1014: error: expected â)â before â*â token
/usr/include/httpd/http_config.h:1014: error: expected declaration specifiers before âapr_array_header_tâ
/usr/include/httpd/http_config.h:1014: error: expected specifier-qualifier-list before âap_HOOK_open_logs_tâ
/usr/include/httpd/http_config.h:1014: error: storage class specified for parameter âap_LINK_open_logs_tâ
/usr/include/httpd/http_config.h:1022: error: expected â)â before â*â token
/usr/include/httpd/http_config.h:1022: error: expected â)â before â*â token
/usr/include/httpd/http_config.h:1022: error: expected â)â before â*â token
/usr/include/httpd/http_config.h:1022: error: expected declaration specifiers before âapr_array_header_tâ
/usr/include/httpd/http_config.h:1022: error: expected specifier-qualifier-list before âap_HOOK_child_init_tâ
/usr/include/httpd/http_config.h:1022: error: storage class specified for parameter âap_LINK_child_init_tâ
/usr/include/httpd/http_config.h:1029: error: expected â)â before â*â token
/usr/include/httpd/http_config.h:1029: error: expected â)â before â*â token
/usr/include/httpd/http_config.h:1029: error: expected â)â before â*â token
/usr/include/httpd/http_config.h:1029: error: expected declaration specifiers before âapr_array_header_tâ
/usr/include/httpd/http_config.h:1029: error: expected specifier-qualifier-list before âap_HOOK_handler_tâ
/usr/include/httpd/http_config.h:1029: error: storage class specified for parameter âap_LINK_handler_tâ
/usr/include/httpd/http_config.h:1042: error: expected â)â before â*â token
/usr/include/httpd/http_config.h:1042: error: expected â)â before â*â token
/usr/include/httpd/http_config.h:1042: error: expected â)â before â*â token
/usr/include/httpd/http_config.h:1042: error: expected declaration specifiers before âapr_array_header_tâ
/usr/include/httpd/http_config.h:1042: error: expected specifier-qualifier-list before âap_HOOK_quick_handler_tâ
/usr/include/httpd/http_config.h:1042: error: storage class specified for parameter âap_LINK_quick_handler_tâ
/usr/include/httpd/http_config.h:1049: error: storage class specified for parameter âap_HOOK_optional_fn_retrieve_tâ
/usr/include/httpd/http_config.h:1049: error: expected â)â before â*â token
/usr/include/httpd/http_config.h:1049: error: expected declaration specifiers before âapr_array_header_tâ
/usr/include/httpd/http_config.h:1049: error: expected specifier-qualifier-list before âap_HOOK_optional_fn_retrieve_tâ
/usr/include/httpd/http_config.h:1049: error: storage class specified for parameter âap_LINK_optional_fn_retrieve_tâ
In file included from /usr/include/httpd/http_core.h:30,
from mod_ruby.h:54,
from mod_ruby.c:33:
/usr/include/apr-1/apr_hash.h:52: error: storage class specified for parameter âapr_hash_tâ
/usr/include/apr-1/apr_hash.h:57: error: storage class specified for parameter âapr_hash_index_tâ
/usr/include/apr-1/apr_hash.h:65: error: expected declaration specifiers or â...â before âapr_ssize_tâ
/usr/include/apr-1/apr_hash.h:65: error: storage class specified for parameter âapr_hashfunc_tâ
/usr/include/apr-1/apr_hash.h:70: error: expected declaration specifiers before âAPR_DECLARE_NONSTDâ
/usr/include/apr-1/apr_hash.h:78: error: expected declaration specifiers before âAPR_DECLAREâ
/usr/include/apr-1/apr_hash.h:86: error: expected declaration specifiers before âAPR_DECLAREâ
/usr/include/apr-1/apr_hash.h:96: error: expected declaration specifiers before âAPR_DECLAREâ
/usr/include/apr-1/apr_hash.h:107: error: expected declaration specifiers before âAPR_DECLAREâ
/usr/include/apr-1/apr_hash.h:117: error: expected declaration specifiers before âAPR_DECLAREâ
/usr/include/apr-1/apr_hash.h:148: error: expected declaration specifiers before âAPR_DECLAREâ
/usr/include/apr-1/apr_hash.h:156: error: expected declaration specifiers before âAPR_DECLAREâ
/usr/include/apr-1/apr_hash.h:167: error: expected declaration specifiers before âAPR_DECLAREâ
/usr/include/apr-1/apr_hash.h:175: error: expected declaration specifiers before âAPR_DECLAREâ
/usr/include/apr-1/apr_hash.h:186: error: expected declaration specifiers before âAPR_DECLAREâ
/usr/include/apr-1/apr_hash.h:204: error: expected declaration specifiers before âAPR_DECLAREâ
/usr/include/apr-1/apr_hash.h:218: error: expected declaration specifiers before âAPR_DECLAREâ
In file included from /usr/include/httpd/http_core.h:31,
from mod_ruby.h:54,
from mod_ruby.c:33:
/usr/include/apr-1/apr_optional.h:59: error: storage class specified for parameter âapr_opt_fn_tâ
/usr/include/apr-1/apr_optional.h:62: error: expected declaration specifiers or â...â before âapr_opt_fn_tâ
/usr/include/apr-1/apr_optional.h:78: error: expected declaration specifiers before âapr_opt_fn_tâ
In file included from /usr/include/httpd/http_core.h:32,
from mod_ruby.h:54,
from mod_ruby.c:33:
/usr/include/httpd/util_filter.h:72: error: storage class specified for parameter âap_input_mode_tâ
/usr/include/httpd/util_filter.h:101: error: storage class specified for parameter âap_filter_tâ
/usr/include/httpd/util_filter.h:136: error: expected â)â before â*â token
/usr/include/httpd/util_filter.h:138: error: expected â)â before â*â token
/usr/include/httpd/util_filter.h:143: error: expected â)â before â*â token
/usr/include/httpd/util_filter.h:146: error: expected specifier-qualifier-list before âap_out_filter_funcâ
/usr/include/httpd/util_filter.h:148: error: storage class specified for parameter âap_filter_funcâ
/usr/include/httpd/util_filter.h:186: error: storage class specified for parameter âap_filter_typeâ
/usr/include/httpd/util_filter.h:201: error: storage class specified for parameter âap_filter_rec_tâ
/usr/include/httpd/util_filter.h:202: error: storage class specified for parameter âap_filter_provider_tâ
/usr/include/httpd/util_filter.h:222: error: expected specifier-qualifier-list before âap_filter_funcâ
/usr/include/httpd/util_filter.h:249: warning: empty declaration
/usr/include/httpd/util_filter.h:262: error: expected specifier-qualifier-list before âap_filter_rec_tâ
/usr/include/httpd/util_filter.h:280: warning: empty declaration
/usr/include/httpd/util_filter.h:295: error: expected â)â before â*â token
/usr/include/httpd/util_filter.h:309: error: expected â)â before â*â token
/usr/include/httpd/util_filter.h:326: error: expected declaration specifiers before âap_filter_rec_tâ
/usr/include/httpd/util_filter.h:347: error: expected declaration specifiers before âap_filter_rec_tâ
/usr/include/httpd/util_filter.h:372: error: expected declaration specifiers before âap_filter_rec_tâ
/usr/include/httpd/util_filter.h:397: error: expected declaration specifiers before âap_filter_tâ
/usr/include/httpd/util_filter.h:409: error: expected declaration specifiers before âap_filter_tâ
/usr/include/httpd/util_filter.h:419: error: expected declaration specifiers before âap_filter_rec_tâ
/usr/include/httpd/util_filter.h:429: error: expected declaration specifiers before âap_filter_tâ
/usr/include/httpd/util_filter.h:440: error: expected declaration specifiers before âap_filter_tâ
/usr/include/httpd/util_filter.h:450: error: expected declaration specifiers before âap_filter_rec_tâ
/usr/include/httpd/util_filter.h:458: error: expected â)â before â*â token
/usr/include/httpd/util_filter.h:466: error: expected â)â before â*â token
/usr/include/httpd/util_filter.h:491: error: expected â)â before â*â token
/usr/include/httpd/util_filter.h:503: error: expected â)â before â*â token
/usr/include/httpd/util_filter.h:511: error: expected â)â before â*â token
/usr/include/httpd/util_filter.h:547: error: expected â)â before â*â token
/usr/include/httpd/util_filter.h:558: error: expected â)â before â*â token
/usr/include/httpd/util_filter.h:570: error: expected â)â before â*â token
In file included from mod_ruby.h:54,
from mod_ruby.c:33:
/usr/include/httpd/http_core.h:139: error: expected â)â before â*â token
/usr/include/httpd/http_core.h:146: error: expected â)â before â*â token
/usr/include/httpd/http_core.h:153: error: expected â)â before â*â token
/usr/include/httpd/http_core.h:162: error: expected â)â before â*â token
/usr/include/httpd/http_core.h:188: error: expected â)â before â*â token
/usr/include/httpd/http_core.h:196: error: expected â)â before â*â token
/usr/include/httpd/http_core.h:208: error: expected â)â before â*â token
/usr/include/httpd/http_core.h:215: error: expected â)â before â*â token
/usr/include/httpd/http_core.h:222: error: expected declaration specifiers before âapr_port_tâ
/usr/include/httpd/http_core.h:229: error: expected declaration specifiers before âapr_off_tâ
/usr/include/httpd/http_core.h:236: warning: type defaults to âintâ in declaration of ârequest_recâ
/usr/include/httpd/http_core.h:236: error: expected â;â, â,â or â)â before â*â token
/usr/include/httpd/http_core.h:245: error: expected â)â before â*â token
/usr/include/httpd/http_core.h:252: warning: type defaults to âintâ in declaration of ârequest_recâ
/usr/include/httpd/http_core.h:252: error: expected â;â, â,â or â)â before â*â token
/usr/include/httpd/http_core.h:261: error: expected â)â before â*â token
/usr/include/httpd/http_core.h:271: error: storage class specified for parameter ârequire_lineâ
/usr/include/httpd/http_core.h:278: error: expected specifier-qualifier-list before âapr_int64_tâ
/usr/include/httpd/http_core.h:281: warning: empty declaration
/usr/include/httpd/http_core.h:288: error: expected â)â before â*â token
/usr/include/httpd/http_core.h:295: error: expected â)â before â*â token
/usr/include/httpd/http_core.h:307: error: expected â)â before â*â token
/usr/include/httpd/http_core.h:314: error: expected â=â, â,â, â;â, âasmâ or â__attribute__â before â*â token
/usr/include/httpd/http_core.h:616: error: expected â)â before â*â token
/usr/include/httpd/http_core.h:617: error: expected â)â before â*â token
/usr/include/httpd/http_core.h:628: error: storage class specified for parameter âap_mgmt_type_eâ
/usr/include/httpd/http_core.h:633: error: expected specifier-qualifier-list before âapr_hash_tâ
/usr/include/httpd/http_core.h:634: error: storage class specified for parameter âap_mgmt_valueâ
/usr/include/httpd/http_core.h:639: error: expected specifier-qualifier-list before âap_mgmt_type_eâ
/usr/include/httpd/http_core.h:641: error: storage class specified for parameter âap_mgmt_item_tâ
/usr/include/httpd/http_core.h:644: error: expected â=â, â,â, â;â, âasmâ or â__attribute__â before â*â token
/usr/include/httpd/http_core.h:645: error: expected â=â, â,â, â;â, âasmâ or â__attribute__â before â*â token
/usr/include/httpd/http_core.h:646: error: expected â=â, â,â, â;â, âasmâ or â__attribute__â before â*â token
/usr/include/httpd/http_core.h:647: error: expected â=â, â,â, â;â, âasmâ or â__attribute__â before â*â token
/usr/include/httpd/http_core.h:662: error: expected â)â before â*â token
/usr/include/httpd/http_core.h:662: error: expected â)â before â*â token
/usr/include/httpd/http_core.h:662: error: expected â)â before â*â token
/usr/include/httpd/http_core.h:662: error: expected declaration specifiers before âapr_array_header_tâ
/usr/include/httpd/http_core.h:662: error: expected specifier-qualifier-list before âap_HOOK_get_mgmt_items_tâ
/usr/include/httpd/http_core.h:662: error: storage class specified for parameter âap_LINK_get_mgmt_items_tâ
/usr/include/httpd/http_core.h:672: error: expected â)â before â*â token
/usr/include/httpd/http_core.h:680: error: expected â)â before â*â token
In file included from /usr/include/httpd/http_log.h:33,
from mod_ruby.h:55,
from mod_ruby.c:33:
/usr/include/apr-1/apr_thread_proc.h:53: error: storage class specified for parameter âapr_cmdtype_eâ
/usr/include/apr-1/apr_thread_proc.h:58: error: storage class specified for parameter âapr_wait_how_eâ
/usr/include/apr-1/apr_thread_proc.h:69: error: storage class specified for parameter âapr_exit_why_eâ
/usr/include/apr-1/apr_thread_proc.h:126: error: expected specifier-qualifier-list before âapr_file_tâ
/usr/include/apr-1/apr_thread_proc.h:150: error: storage class specified for parameter âapr_proc_tâ
/usr/include/apr-1/apr_thread_proc.h:162: error: expected â)â before â*â token
/usr/include/apr-1/apr_thread_proc.h:166: error: storage class specified for parameter âapr_thread_tâ
/usr/include/apr-1/apr_thread_proc.h:169: error: storage class specified for parameter âapr_threadattr_tâ
/usr/include/apr-1/apr_thread_proc.h:172: error: storage class specified for parameter âapr_procattr_tâ
/usr/include/apr-1/apr_thread_proc.h:175: error: storage class specified for parameter âapr_thread_once_tâ
/usr/include/apr-1/apr_thread_proc.h:178: error: storage class specified for parameter âapr_threadkey_tâ
/usr/include/apr-1/apr_thread_proc.h:181: error: storage class specified for parameter âapr_other_child_rec_tâ
/usr/include/apr-1/apr_thread_proc.h:186: error: expected â)â before â*â token
/usr/include/apr-1/apr_thread_proc.h:194: error: storage class specified for parameter âapr_kill_conditions_eâ
/usr/include/apr-1/apr_thread_proc.h:385: error: expected declaration specifiers before âAPR_DECLAREâ
/usr/include/apr-1/apr_thread_proc.h:396: error: expected declaration specifiers before âAPR_DECLAREâ
/usr/include/apr-1/apr_thread_proc.h:412: error: expected declaration specifiers before âAPR_DECLAREâ
/usr/include/apr-1/apr_thread_proc.h:426: error: expected declaration specifiers before âAPR_DECLAREâ
/usr/include/apr-1/apr_thread_proc.h:440: error: expected declaration specifiers before âAPR_DECLAREâ
/usr/include/apr-1/apr_thread_proc.h:451: error: expected declaration specifiers before âAPR_DECLAREâ
/usr/include/apr-1/apr_thread_proc.h:465: error: expected declaration specifiers before âAPR_DECLAREâ
/usr/include/apr-1/apr_thread_proc.h:473: error: expected declaration specifiers before âAPR_DECLAREâ
/usr/include/apr-1/apr_thread_proc.h:505: error: expected declaration specifiers before âAPR_DECLAREâ
/usr/include/apr-1/apr_thread_proc.h:520: error: expected declaration specifiers before âAPR_DECLAREâ
/usr/include/apr-1/apr_thread_proc.h:530: error: expected declaration specifiers before âAPR_DECLAREâ
/usr/include/apr-1/apr_thread_proc.h:541: error: expected declaration specifiers before âAPR_DECLAREâ
/usr/include/apr-1/apr_thread_proc.h:550: error: expected declaration specifiers before âAPR_DECLAREâ
/usr/include/apr-1/apr_thread_proc.h:582: error: expected declaration specifiers before âAPR_DECLAREâ
/usr/include/apr-1/apr_thread_proc.h:615: error: expected declaration specifiers before âAPR_DECLAREâ
/usr/include/apr-1/apr_thread_proc.h:645: error: expected declaration specifiers before âAPR_DECLAREâ
/usr/include/apr-1/apr_thread_proc.h:660: error: expected declaration specifiers before âAPR_DECLAREâ
/usr/include/apr-1/apr_thread_proc.h:679: error: expected declaration specifiers before âAPR_DECLAREâ
/usr/include/apr-1/apr_thread_proc.h:695: error: expected declaration specifiers before âAPR_DECLAREâ
/usr/include/apr-1/apr_thread_proc.h:717: error: expected declaration specifiers before âAPR_DECLAREâ
/usr/include/apr-1/apr_thread_proc.h:728: error: expected declaration specifiers before âAPR_DECLAREâ
/usr/include/apr-1/apr_thread_proc.h:737: error: expected declaration specifiers before âAPR_DECLAREâ
/usr/include/apr-1/apr_thread_proc.h:744: error: expected declaration specifiers before âAPR_DECLAREâ
/usr/include/apr-1/apr_thread_proc.h:759: error: expected declaration specifiers before âAPR_DECLAREâ
In file included from /usr/include/syslog.h:1,
from /usr/include/httpd/http_log.h:36,
from mod_ruby.h:55,
from mod_ruby.c:33:
/usr/include/sys/syslog.h:175: error: storage class specified for parameter âcloselogâ
/usr/include/sys/syslog.h:181: error: storage class specified for parameter âopenlogâ
/usr/include/sys/syslog.h:184: error: storage class specified for parameter âsetlogmaskâ
/usr/include/sys/syslog.h:191: error: storage class specified for parameter âsyslogâ
/usr/include/sys/syslog.h:201: error: storage class specified for parameter âvsyslogâ
In file included from /usr/include/sys/syslog.h:207,
from /usr/include/syslog.h:1,
from /usr/include/httpd/http_log.h:36,
from mod_ruby.h:55,
from mod_ruby.c:33:
/usr/include/bits/syslog.h:26: error: storage class specified for parameter â__syslog_chkâ
/usr/include/bits/syslog.h:35: error: storage class specified for parameter â__vsyslog_chkâ
In file included from mod_ruby.h:55,
from mod_ruby.c:33:
/usr/include/httpd/http_log.h:94: error: storage class specified for parameter âap_default_loglevelâ
/usr/include/httpd/http_log.h:102: error: expected â)â before â*â token
/usr/include/httpd/http_log.h:109: error: expected â)â before â*â token
/usr/include/httpd/http_log.h:121: error: expected â)â before â*â token
/usr/include/httpd/http_log.h:172: warning: type defaults to âintâ in declaration of âserver_recâ
/usr/include/httpd/http_log.h:172: error: expected â;â, â,â or â)â before â*â token
/usr/include/httpd/http_log.h:196: error: expected declaration specifiers or â...â before âapr_pool_tâ
/usr/include/httpd/http_log.h:198: error: format string argument not a string type
/usr/include/httpd/http_log.h:220: warning: type defaults to âintâ in declaration of ârequest_recâ
/usr/include/httpd/http_log.h:220: error: expected â;â, â,â or â)â before â*â token
/usr/include/httpd/http_log.h:246: warning: type defaults to âintâ in declaration of âconn_recâ
/usr/include/httpd/http_log.h:246: error: expected â;â, â,â or â)â before â*â token
/usr/include/httpd/http_log.h:254: error: expected â)â before â*â token
/usr/include/httpd/http_log.h:261: error: expected â)â before â*â token
/usr/include/httpd/http_log.h:269: error: expected â)â before â*â token
/usr/include/httpd/http_log.h:272: error: storage class specified for parameter âpiped_logâ
/usr/include/httpd/http_log.h:282: error: expected specifier-qualifier-list before âapr_pool_tâ
/usr/include/httpd/http_log.h:293: warning: empty declaration
/usr/include/httpd/http_log.h:301: error: expected declaration specifiers before âpiped_logâ
/usr/include/httpd/http_log.h:307: error: expected â)â before â*â token
/usr/include/httpd/http_log.h:335: warning: type defaults to âintâ in declaration of âserver_recâ
/usr/include/httpd/http_log.h:335: error: expected â;â, â,â or â)â before â*â token
/usr/include/httpd/http_log.h:335: error: expected â)â before â*â token
/usr/include/httpd/http_log.h:335: warning: type defaults to âintâ in declaration of âserver_recâ
/usr/include/httpd/http_log.h:335: error: expected â;â, â,â or â)â before â*â token
/usr/include/httpd/http_log.h:335: error: expected declaration specifiers before âapr_array_header_tâ
/usr/include/httpd/http_log.h:335: error: expected specifier-qualifier-list before âap_HOOK_error_log_tâ
/usr/include/httpd/http_log.h:335: error: storage class specified for parameter âap_LINK_error_log_tâ
In file included from mod_ruby.h:56,
from mod_ruby.c:33:
/usr/include/httpd/http_main.h:42: error: storage class specified for parameter âap_server_argv0â
/usr/include/httpd/http_main.h:44: error: storage class specified for parameter âap_server_rootâ
/usr/include/httpd/http_main.h:49: error: expected â=â, â,â, â;â, âasmâ or â__attribute__â before â*â token
/usr/include/httpd/http_main.h:52: error: expected â=â, â,â, â;â, âasmâ or â__attribute__â before â*â token
/usr/include/httpd/http_main.h:55: error: expected â=â, â,â, â;â, âasmâ or â__attribute__â before â*â token
/usr/include/httpd/http_main.h:64: error: expected declaration specifiers or â...â before âapr_pool_tâ
/usr/include/httpd/http_main.h:64: error: storage class specified for parameter âapr_OFN_ap_signal_server_tâ
In file included from /usr/include/apr-1/apr_global_mutex.h:26,
from /usr/include/apr-1/apr_portable.h:34,
from /usr/include/httpd/http_protocol.h:31,
from mod_ruby.h:57,
from mod_ruby.c:33:
/usr/include/apr-1/apr_proc_mutex.h:51: error: storage class specified for parameter âapr_lockmech_eâ
/usr/include/apr-1/apr_proc_mutex.h:54: error: storage class specified for parameter âapr_proc_mutex_tâ
/usr/include/apr-1/apr_proc_mutex.h:79: error: expected declaration specifiers before âAPR_DECLAREâ
/usr/include/apr-1/apr_proc_mutex.h:95: error: expected declaration specifiers before âAPR_DECLAREâ
/usr/include/apr-1/apr_proc_mutex.h:104: error: expected declaration specifiers before âAPR_DECLAREâ
/usr/include/apr-1/apr_proc_mutex.h:113: error: expected declaration specifiers before âAPR_DECLAREâ
/usr/include/apr-1/apr_proc_mutex.h:119: error: expected declaration specifiers before âAPR_DECLAREâ
/usr/include/apr-1/apr_proc_mutex.h:125: error: expected declaration specifiers before âAPR_DECLAREâ
/usr/include/apr-1/apr_proc_mutex.h:133: error: expected declaration specifiers before âAPR_DECLAREâ
/usr/include/apr-1/apr_proc_mutex.h:140: error: expected declaration specifiers before âAPR_DECLAREâ
/usr/include/apr-1/apr_proc_mutex.h:147: error: expected declaration specifiers before âAPR_DECLAREâ
/usr/include/apr-1/apr_proc_mutex.h:152: error: expected declaration specifiers before âAPR_DECLAREâ
/usr/include/apr-1/apr_proc_mutex.h:158: error: expected declaration specifiers before âAPR_DECLAREâ
In file included from /usr/include/apr-1/apr_portable.h:34,
from /usr/include/httpd/http_protocol.h:31,
from mod_ruby.h:57,
from mod_ruby.c:33:
/usr/include/apr-1/apr_global_mutex.h:46: error: storage class specified for parameter âapr_global_mutex_tâ
/usr/include/apr-1/apr_global_mutex.h:74: error: expected declaration specifiers before âAPR_DECLAREâ
/usr/include/apr-1/apr_global_mutex.h:90: error: expected declaration specifiers before âAPR_DECLAREâ
/usr/include/apr-1/apr_global_mutex.h:100: error: expected declaration specifiers before âAPR_DECLAREâ
/usr/include/apr-1/apr_global_mutex.h:109: error: expected declaration specifiers before âAPR_DECLAREâ
/usr/include/apr-1/apr_global_mutex.h:115: error: expected declaration specifiers before âAPR_DECLAREâ
/usr/include/apr-1/apr_global_mutex.h:121: error: expected declaration specifiers before âAPR_DECLAREâ
/usr/include/apr-1/apr_global_mutex.h:127: error: expected declaration specifiers before âAPR_DECLAREâ
In file included from /usr/include/apr-1/apr_portable.h:38,
from /usr/include/httpd/http_protocol.h:31,
from mod_ruby.h:57,
from mod_ruby.c:33:
/usr/include/apr-1/apr_shm.h:43: error: storage class specified for parameter âapr_shm_tâ
/usr/include/apr-1/apr_shm.h:68: error: expected declaration specifiers before âAPR_DECLAREâ
/usr/include/apr-1/apr_shm.h:82: error: expected declaration specifiers before âAPR_DECLAREâ
/usr/include/apr-1/apr_shm.h:89: error: expected declaration specifiers before âAPR_DECLAREâ
/usr/include/apr-1/apr_shm.h:100: error: expected declaration specifiers before âAPR_DECLAREâ
/usr/include/apr-1/apr_shm.h:109: error: expected declaration specifiers before âAPR_DECLAREâ
/usr/include/apr-1/apr_shm.h:120: error: expected declaration specifiers before âAPR_DECLAREâ
/usr/include/apr-1/apr_shm.h:127: error: expected declaration specifiers before âAPR_DECLAREâ
/usr/include/apr-1/apr_shm.h:132: error: expected declaration specifiers before âAPR_DECLAREâ
In file included from /usr/include/httpd/http_protocol.h:31,
from mod_ruby.h:57,
from mod_ruby.c:33:
/usr/include/apr-1/apr_portable.h:143: warning: empty declaration
/usr/include/apr-1/apr_portable.h:145: error: storage class specified for parameter âapr_os_file_tâ
/usr/include/apr-1/apr_portable.h:146: error: expected â=â, â,â, â;â, âasmâ or â__attribute__â before âapr_os_dir_tâ
/usr/include/apr-1/apr_portable.h:147: error: storage class specified for parameter âapr_os_sock_tâ
/usr/include/apr-1/apr_portable.h:148: error: storage class specified for parameter âapr_os_proc_mutex_tâ
/usr/include/apr-1/apr_portable.h:156: error: storage class specified for parameter âapr_os_proc_tâ
/usr/include/apr-1/apr_portable.h:157: error: storage class specified for parameter âapr_os_imp_time_tâ
/usr/include/apr-1/apr_portable.h:158: error: storage class specified for parameter âapr_os_exp_time_tâ
/usr/include/apr-1/apr_portable.h:169: error: storage class specified for parameter âapr_os_dso_handle_tâ
/usr/include/apr-1/apr_portable.h:171: error: storage class specified for parameter âapr_os_shm_tâ
/usr/include/apr-1/apr_portable.h:184: error: expected specifier-qualifier-list before âapr_os_sock_tâ
/usr/include/apr-1/apr_portable.h:190: warning: empty declaration
/usr/include/apr-1/apr_portable.h:192: error: storage class specified for parameter âapr_os_sock_info_tâ
/usr/include/apr-1/apr_portable.h:204: error: expected specifier-qualifier-list before âapr_pool_tâ
/usr/include/apr-1/apr_portable.h:209: warning: empty declaration
/usr/include/apr-1/apr_portable.h:210: error: storage class specified for parameter âapr_os_global_mutex_tâ
/usr/include/apr-1/apr_portable.h:212: error: expected declaration specifiers before âAPR_DECLAREâ
/usr/include/apr-1/apr_portable.h:224: error: expected declaration specifiers before âAPR_DECLAREâ
/usr/include/apr-1/apr_portable.h:232: error: expected declaration specifiers before âAPR_DECLAREâ
/usr/include/apr-1/apr_portable.h:240: error: expected declaration specifiers before âAPR_DECLAREâ
/usr/include/apr-1/apr_portable.h:248: error: expected declaration specifiers before âAPR_DECLAREâ
/usr/include/apr-1/apr_portable.h:256: error: expected declaration specifiers before âAPR_DECLAREâ
/usr/include/apr-1/apr_portable.h:264: error: expected declaration specifiers before âAPR_DECLAREâ
/usr/include/apr-1/apr_portable.h:272: error: expected declaration specifiers before âAPR_DECLAREâ
/usr/include/apr-1/apr_portable.h:340: error: expected declaration specifiers before âAPR_DECLAREâ
/usr/include/apr-1/apr_portable.h:352: error: expected declaration specifiers before âAPR_DECLAREâ
/usr/include/apr-1/apr_portable.h:366: error: expected declaration specifiers before âAPR_DECLAREâ
/usr/include/apr-1/apr_portable.h:377: error: expected declaration specifiers before âAPR_DECLAREâ
/usr/include/apr-1/apr_portable.h:389: error: expected declaration specifiers before âAPR_DECLAREâ
/usr/include/apr-1/apr_portable.h:403: error: expected declaration specifiers before âAPR_DECLAREâ
/usr/include/apr-1/apr_portable.h:413: error: expected declaration specifiers before âAPR_DECLAREâ
/usr/include/apr-1/apr_portable.h:423: error: expected declaration specifiers before âAPR_DECLAREâ
/usr/include/apr-1/apr_portable.h:433: error: expected declaration specifiers before âAPR_DECLAREâ
/usr/include/apr-1/apr_portable.h:446: error: expected declaration specifiers before âAPR_DECLAREâ
/usr/include/apr-1/apr_portable.h:489: error: expected declaration specifiers before âAPR_DECLAREâ
/usr/include/apr-1/apr_portable.h:498: error: expected declaration specifiers before âAPR_DECLAREâ
In file included from mod_ruby.h:57,
from mod_ruby.c:33:
/usr/include/httpd/http_protocol.h:45: error: expected â)â before â*â token
/usr/include/httpd/http_protocol.h:45: error: expected â)â before â*â token
/usr/include/httpd/http_protocol.h:45: error: expected â)â before â*â token
/usr/include/httpd/http_protocol.h:45: error: expected declaration specifiers before âapr_array_header_tâ
/usr/include/httpd/http_protocol.h:45: error: expected specifier-qualifier-list before âap_HOOK_insert_error_filter_tâ
/usr/include/httpd/http_protocol.h:45: error: storage class specified for parameter âap_LINK_insert_error_filter_tâ
/usr/include/httpd/http_protocol.h:50: error: expected â=â, â,â, â;â, âasmâ or â__attribute__â before â*â token
/usr/include/httpd/http_protocol.h:62: error: expected declaration specifiers before ârequest_recâ
/usr/include/httpd/http_protocol.h:68: error: expected â)â before â*â token
/usr/include/httpd/http_protocol.h:76: error: expected â)â before â*â token
/usr/include/httpd/http_protocol.h:86: error: expected â)â before â*â token
/usr/include/httpd/http_protocol.h:97: error: expected â)â before â*â token
/usr/include/httpd/http_protocol.h:111: error: expected â)â before â*â token
/usr/include/httpd/http_protocol.h:118: error: expected â)â before â*â token
/usr/include/httpd/http_protocol.h:127: error: expected declaration specifiers before âapr_time_tâ
/usr/include/httpd/http_protocol.h:140: error: expected â)â before â*â token
/usr/include/httpd/http_protocol.h:159: error: expected â)â before â*â token
/usr/include/httpd/http_protocol.h:165: error: expected â)â before â*â token
/usr/include/httpd/http_protocol.h:171: error: expected â)â before â*â token
/usr/include/httpd/http_protocol.h:181: error: expected â)â before â*â token
/usr/include/httpd/http_protocol.h:203: error: expected â)â before â*â token
/usr/include/httpd/http_protocol.h:228: error: expected â)â before â*â token
/usr/include/httpd/http_protocol.h:235: error: expected â)â before â*â token
/usr/include/httpd/http_protocol.h:253: error: expected declaration specifiers before âap_method_list_tâ
/usr/include/httpd/http_protocol.h:262: error: expected â)â before â*â token
/usr/include/httpd/http_protocol.h:273: error: expected â)â before â*â token
/usr/include/httpd/http_protocol.h:283: error: expected â)â before â*â token
/usr/include/httpd/http_protocol.h:292: error: expected â)â before â*â token
/usr/include/httpd/http_protocol.h:301: error: expected â)â before â*â token
/usr/include/httpd/http_protocol.h:310: error: expected â)â before â*â token
/usr/include/httpd/http_protocol.h:322: error: expected declaration specifiers or â...â before ârequest_recâ
/usr/include/httpd/http_protocol.h:330: error: expected declaration specifiers or â...â before ârequest_recâ
/usr/include/httpd/http_protocol.h:339: error: expected declaration specifiers or â...â before ârequest_recâ
/usr/include/httpd/http_protocol.h:347: error: expected â)â before â*â token
/usr/include/httpd/http_protocol.h:356: error: expected â)â before â*â token
/usr/include/httpd/http_protocol.h:365: error: expected â)â before â*â token
/usr/include/httpd/http_protocol.h:373: error: expected â)â before â*â token
/usr/include/httpd/http_protocol.h:405: error: expected â)â before â*â token
/usr/include/httpd/http_protocol.h:415: error: expected â)â before â*â token
/usr/include/httpd/http_protocol.h:426: error: expected â)â before â*â token
/usr/include/httpd/http_protocol.h:438: error: expected â)â before â*â token
/usr/include/httpd/http_protocol.h:446: error: expected â)â before â*â token
/usr/include/httpd/http_protocol.h:454: error: expected â)â before â*â token
/usr/include/httpd/http_protocol.h:462: error: expected â)â before â*â token
/usr/include/httpd/http_protocol.h:476: error: expected â)â before â*â token
/usr/include/httpd/http_protocol.h:487: error: expected â)â before â*â token
/usr/include/httpd/http_protocol.h:499: error: expected declaration specifiers or â...â before ârequest_recâ
/usr/include/httpd/http_protocol.h:534: error: expected declaration specifiers or â...â before âapr_size_tâ
/usr/include/httpd/http_protocol.h:535: error: expected declaration specifiers or â...â before âapr_size_tâ
/usr/include/httpd/http_protocol.h:536: error: expected declaration specifiers or â...â before ârequest_recâ
/usr/include/httpd/http_protocol.h:537: error: expected declaration specifiers or â...â before âapr_bucket_brigadeâ
/usr/include/httpd/http_protocol.h:554: error: expected â)â before â*â token
/usr/include/httpd/http_protocol.h:569: error: expected â)â before â*â token
/usr/include/httpd/http_protocol.h:569: error: expected â)â before â*â token
/usr/include/httpd/http_protocol.h:569: error: expected â)â before â*â token
/usr/include/httpd/http_protocol.h:569: error: expected declaration specifiers before âapr_array_header_tâ
/usr/include/httpd/http_protocol.h:569: error: expected specifier-qualifier-list before âap_HOOK_post_read_request_tâ
/usr/include/httpd/http_protocol.h:569: error: storage class specified for parameter âap_LINK_post_read_request_tâ
/usr/include/httpd/http_protocol.h:577: error: expected â)â before â*â token
/usr/include/httpd/http_protocol.h:577: error: expected â)â before â*â token
/usr/include/httpd/http_protocol.h:577: error: expected â)â before â*â token
/usr/include/httpd/http_protocol.h:577: error: expected declaration specifiers before âapr_array_header_tâ
/usr/include/httpd/http_protocol.h:577: error: expected specifier-qualifier-list before âap_HOOK_log_transaction_tâ
/usr/include/httpd/http_protocol.h:577: error: storage class specified for parameter âap_LINK_log_transaction_tâ
/usr/include/httpd/http_protocol.h:585: warning: type defaults to âintâ in declaration of ârequest_recâ
/usr/include/httpd/http_protocol.h:585: error: expected â;â, â,â or â)â before â*â token
/usr/include/httpd/http_protocol.h:585: error: expected â)â before â*â token
/usr/include/httpd/http_protocol.h:585: warning: type defaults to âintâ in declaration of ârequest_recâ
/usr/include/httpd/http_protocol.h:585: error: expected â;â, â,â or â)â before â*â token
/usr/include/httpd/http_protocol.h:585: error: expected declaration specifiers before âapr_array_header_tâ
/usr/include/httpd/http_protocol.h:585: error: expected specifier-qualifier-list before âap_HOOK_http_scheme_tâ
/usr/include/httpd/http_protocol.h:585: error: storage class specified for parameter âap_LINK_http_scheme_tâ
/usr/include/httpd/http_protocol.h:592: error: expected â=â, â,â, â;â, âasmâ or â__attribute__â before âap_HOOK_default_port_tâ
/usr/include/httpd/http_protocol.h:592: error: expected â)â before â*â token
/usr/include/httpd/http_protocol.h:592: error: expected declaration specifiers before âapr_port_tâ
/usr/include/httpd/http_protocol.h:592: error: expected declaration specifiers before âapr_array_header_tâ
/usr/include/httpd/http_protocol.h:592: error: expected specifier-qualifier-list before âap_HOOK_default_port_tâ
/usr/include/httpd/http_protocol.h:592: error: storage class specified for parameter âap_LINK_default_port_tâ
/usr/include/httpd/http_protocol.h:595: error: storage class specified for parameter âap_bucket_errorâ
/usr/include/httpd/http_protocol.h:608: error: expected specifier-qualifier-list before âapr_bucket_refcountâ
/usr/include/httpd/http_protocol.h:613: warning: empty declaration
/usr/include/httpd/http_protocol.h:616: error: expected â=â, â,â, â;â, âasmâ or â__attribute__â before âap_bucket_type_errorâ
/usr/include/httpd/http_protocol.h:633: error: expected declaration specifiers before âapr_bucketâ
/usr/include/httpd/http_protocol.h:644: error: expected declaration specifiers before âapr_bucketâ
/usr/include/httpd/http_protocol.h:648: error: expected â)â before â*â token
/usr/include/httpd/http_protocol.h:649: error: expected â)â before â*â token
/usr/include/httpd/http_protocol.h:650: error: expected â)â before â*â token
/usr/include/httpd/http_protocol.h:652: error: expected â)â before â*â token
/usr/include/httpd/http_protocol.h:659: error: expected â)â before â*â token
/usr/include/httpd/http_protocol.h:666: error: expected â)â before â*â token
In file included from mod_ruby.h:58,
from mod_ruby.c:33:
/usr/include/httpd/http_request.h:60: error: expected â)â before â*â token
/usr/include/httpd/http_request.h:71: error: expected declaration specifiers before ârequest_recâ
/usr/include/httpd/http_request.h:84: error: expected declaration specifiers before ârequest_recâ
/usr/include/httpd/http_request.h:105: error: expected declaration specifiers before ârequest_recâ
/usr/include/httpd/http_request.h:119: error: expected declaration specifiers before ârequest_recâ
/usr/include/httpd/http_request.h:130: error: expected â)â before â*â token
/usr/include/httpd/http_request.h:138: error: expected â)â before â*â token
/usr/include/httpd/http_request.h:144: error: expected â)â before â*â token
/usr/include/httpd/http_request.h:157: error: expected declaration specifiers or â...â before ârequest_recâ
/usr/include/httpd/http_request.h:166: error: expected declaration specifiers or â...â before ârequest_recâ
/usr/include/httpd/http_request.h:175: error: expected â)â before â*â token
/usr/include/httpd/http_request.h:183: error: expected â)â before â*â token
/usr/include/httpd/http_request.h:190: error: expected â)â before â*â token
/usr/include/httpd/http_request.h:198: error: expected â)â before â*â token
/usr/include/httpd/http_request.h:215: error: expected â)â before â*â token
/usr/include/httpd/http_request.h:233: error: expected â)â before â*â token
/usr/include/httpd/http_request.h:261: error: expected â)â before â*â token
/usr/include/httpd/http_request.h:261: error: expected â)â before â*â token
/usr/include/httpd/http_request.h:261: error: expected â)â before â*â token
/usr/include/httpd/http_request.h:261: error: expected declaration specifiers before âapr_array_header_tâ
/usr/include/httpd/http_request.h:261: error: expected specifier-qualifier-list before âap_HOOK_create_request_tâ
/usr/include/httpd/http_request.h:261: error: storage class specified for parameter âap_LINK_create_request_tâ
/usr/include/httpd/http_request.h:271: error: expected â)â before â*â token
/usr/include/httpd/http_request.h:271: error: expected â)â before â*â token
/usr/include/httpd/http_request.h:271: error: expected â)â before â*â token
/usr/include/httpd/http_request.h:271: error: expected declaration specifiers before âapr_array_header_tâ
/usr/include/httpd/http_request.h:271: error: expected specifier-qualifier-list before âap_HOOK_translate_name_tâ
/usr/include/httpd/http_request.h:271: error: storage class specified for parameter âap_LINK_translate_name_tâ
/usr/include/httpd/http_request.h:286: error: expected â)â before â*â token
/usr/include/httpd/http_request.h:286: error: expected â)â before â*â token
/usr/include/httpd/http_request.h:286: error: expected â)â before â*â token
/usr/include/httpd/http_request.h:286: error: expected declaration specifiers before âapr_array_header_tâ
/usr/include/httpd/http_request.h:286: error: expected specifier-qualifier-list before âap_HOOK_map_to_storage_tâ
/usr/include/httpd/http_request.h:286: error: storage class specified for parameter âap_LINK_map_to_storage_tâ
/usr/include/httpd/http_request.h:300: error: expected â)â before â*â token
/usr/include/httpd/http_request.h:300: error: expected â)â before â*â token
/usr/include/httpd/http_request.h:300: error: expected â)â before â*â token
/usr/include/httpd/http_request.h:300: error: expected declaration specifiers before âapr_array_header_tâ
/usr/include/httpd/http_request.h:300: error: expected specifier-qualifier-list before âap_HOOK_check_user_id_tâ
/usr/include/httpd/http_request.h:300: error: storage class specified for parameter âap_LINK_check_user_id_tâ
/usr/include/httpd/http_request.h:309: error: expected â)â before â*â token
/usr/include/httpd/http_request.h:309: error: expected â)â before â*â token
/usr/include/httpd/http_request.h:309: error: expected â)â before â*â token
/usr/include/httpd/http_request.h:309: error: expected declaration specifiers before âapr_array_header_tâ
/usr/include/httpd/http_request.h:309: error: expected specifier-qualifier-list before âap_HOOK_fixups_tâ
/usr/include/httpd/http_request.h:309: error: storage class specified for parameter âap_LINK_fixups_tâ
/usr/include/httpd/http_request.h:319: error: expected â)â before â*â token
/usr/include/httpd/http_request.h:319: error: expected â)â before â*â token
/usr/include/httpd/http_request.h:319: error: expected â)â before â*â token
/usr/include/httpd/http_request.h:319: error: expected declaration specifiers before âapr_array_header_tâ
/usr/include/httpd/http_request.h:319: error: expected specifier-qualifier-list before âap_HOOK_type_checker_tâ
/usr/include/httpd/http_request.h:319: error: storage class specified for parameter âap_LINK_type_checker_tâ
/usr/include/httpd/http_request.h:331: error: expected â)â before â*â token
/usr/include/httpd/http_request.h:331: error: expected â)â before â*â token
/usr/include/httpd/http_request.h:331: error: expected â)â before â*â token
/usr/include/httpd/http_request.h:331: error: expected declaration specifiers before âapr_array_header_tâ
/usr/include/httpd/http_request.h:331: error: expected specifier-qualifier-list before âap_HOOK_access_checker_tâ
/usr/include/httpd/http_request.h:331: error: storage class specified for parameter âap_LINK_access_checker_tâ
/usr/include/httpd/http_request.h:344: error: expected â)â before â*â token
/usr/include/httpd/http_request.h:344: error: expected â)â before â*â token
/usr/include/httpd/http_request.h:344: error: expected â)â before â*â token
/usr/include/httpd/http_request.h:344: error: expected declaration specifiers before âapr_array_header_tâ
/usr/include/httpd/http_request.h:344: error: expected specifier-qualifier-list before âap_HOOK_auth_checker_tâ
/usr/include/httpd/http_request.h:344: error: storage class specified for parameter âap_LINK_auth_checker_tâ
/usr/include/httpd/http_request.h:351: error: expected â)â before â*â token
/usr/include/httpd/http_request.h:351: error: expected â)â before â*â token
/usr/include/httpd/http_request.h:351: error: expected â)â before â*â token
/usr/include/httpd/http_request.h:351: error: expected declaration specifiers before âapr_array_header_tâ
/usr/include/httpd/http_request.h:351: error: expected specifier-qualifier-list before âap_HOOK_insert_filter_tâ
/usr/include/httpd/http_request.h:351: error: storage class specified for parameter âap_LINK_insert_filter_tâ
/usr/include/httpd/http_request.h:353: error: expected â)â before â*â token
/usr/include/httpd/http_request.h:354: error: expected â)â before â*â token
/usr/include/httpd/http_request.h:355: error: expected â)â before â*â token
In file included from mod_ruby.h:59,
from mod_ruby.c:33:
/usr/include/httpd/util_script.h:51: error: expected â)â before â*â token
/usr/include/httpd/util_script.h:70: error: expected â)â before â*â token
/usr/include/httpd/util_script.h:77: error: expected â)â before â*â token
/usr/include/httpd/util_script.h:90: error: expected â)â before â*â token
/usr/include/httpd/util_script.h:103: error: expected â)â before â*â token
/usr/include/httpd/util_script.h:121: error: expected â)â before â*â token
/usr/include/httpd/util_script.h:139: error: expected â)â before â*â token
In file included from mod_ruby.h:80,
from mod_ruby.c:33:
/usr/include/apr-1/apr_lib.h:59: error: storage class specified for parameter âapr_vformatter_buff_tâ
/usr/include/apr-1/apr_lib.h:69: warning: empty declaration
/usr/include/apr-1/apr_lib.h:84: error: expected declaration specifiers before âAPR_DECLAREâ
/usr/include/apr-1/apr_lib.h:165: error: expected declaration specifiers before âAPR_DECLAREâ
/usr/include/apr-1/apr_lib.h:180: error: expected declaration specifiers before âAPR_DECLAREâ
In file included from mod_ruby.h:82,
from mod_ruby.c:33:
/usr/include/apr-1/apr_strings.h:76: error: expected declaration specifiers before âAPR_DECLAREâ
/usr/include/apr-1/apr_strings.h:87: error: expected declaration specifiers before âAPR_DECLAREâ
/usr/include/apr-1/apr_strings.h:95: error: expected declaration specifiers before âAPR_DECLAREâ
/usr/include/apr-1/apr_strings.h:109: error: expected declaration specifiers before âAPR_DECLAREâ
/usr/include/apr-1/apr_strings.h:119: error: expected declaration specifiers before âAPR_DECLAREâ
/usr/include/apr-1/apr_strings.h:129: error: expected declaration specifiers before âAPR_DECLAREâ
/usr/include/apr-1/apr_strings.h:137: error: expected declaration specifiers before âAPR_DECLARE_NONSTDâ
/usr/include/apr-1/apr_strings.h:147: error: expected declaration specifiers before âAPR_DECLAREâ
/usr/include/apr-1/apr_strings.h:158: error: expected declaration specifiers before âAPR_DECLAREâ
/usr/include/apr-1/apr_strings.h:168: error: expected declaration specifiers before âAPR_DECLARE_NONSTDâ
/usr/include/apr-1/apr_strings.h:193: error: expected declaration specifiers before âAPR_DECLAREâ
/usr/include/apr-1/apr_strings.h:203: error: expected declaration specifiers before âAPR_DECLAREâ
/usr/include/apr-1/apr_strings.h:212: error: expected declaration specifiers before âAPR_DECLAREâ
/usr/include/apr-1/apr_strings.h:227: error: expected declaration specifiers before âAPR_DECLAREâ
/usr/include/apr-1/apr_strings.h:259: error: expected declaration specifiers before âAPR_DECLARE_NONSTDâ
/usr/include/apr-1/apr_strings.h:271: error: expected declaration specifiers before âAPR_DECLAREâ
/usr/include/apr-1/apr_strings.h:281: error: expected declaration specifiers before âAPR_DECLAREâ
/usr/include/apr-1/apr_strings.h:289: error: expected declaration specifiers before âAPR_DECLAREâ
/usr/include/apr-1/apr_strings.h:297: error: expected declaration specifiers before âAPR_DECLAREâ
/usr/include/apr-1/apr_strings.h:313: error: expected declaration specifiers before âAPR_DECLAREâ
/usr/include/apr-1/apr_strings.h:331: error: expected declaration specifiers before âAPR_DECLAREâ
/usr/include/apr-1/apr_strings.h:339: error: expected declaration specifiers before âAPR_DECLAREâ
/usr/include/apr-1/apr_strings.h:349: error: expected declaration specifiers before âAPR_DECLAREâ
In file included from mod_ruby.c:33:
mod_ruby.h:87: error: expected â=â, â,â, â;â, âasmâ or â__attribute__â before âpoolâ
mod_ruby.h:88: error: expected â=â, â,â, â;â, âasmâ or â__attribute__â before âarray_headerâ
mod_ruby.h:89: error: expected â=â, â,â, â;â, âasmâ or â__attribute__â before âtableâ
mod_ruby.h:90: error: expected â=â, â,â, â;â, âasmâ or â__attribute__â before âtable_entryâ
In file included from mod_ruby.h:165,
from mod_ruby.c:33:
apache_request.h:29: error: storage class specified for parameter âApacheUploadâ
apache_request.h:32: error: expected specifier-qualifier-list before âtableâ
apache_request.h:43: error: storage class specified for parameter âApacheRequestâ
apache_request.h:46: error: expected specifier-qualifier-list before âApacheUploadâ
apache_request.h:54: warning: empty declaration
apache_request.h:84: error: expected declaration specifiers before âApacheRequestâ
apache_request.h:85: error: expected â)â before â*â token
apache_request.h:86: error: expected â)â before â*â token
apache_request.h:87: error: expected â)â before â*â token
apache_request.h:88: error: expected â)â before â*â token
apache_request.h:89: error: expected â)â before â*â token
apache_request.h:90: error: expected declaration specifiers before âarray_headerâ
apache_request.h:91: error: expected â)â before â*â token
apache_request.h:92: error: expected â)â before â*â token
apache_request.h:95: error: expected declaration specifiers before âtableâ
apache_request.h:96: error: expected declaration specifiers before âtableâ
apache_request.h:98: error: expected â)â before â*â token
apache_request.h:99: error: expected declaration specifiers before âApacheUploadâ
apache_request.h:100: error: expected declaration specifiers before âApacheUploadâ
apache_request.h:123: error: expected â)â before â*â token
apache_request.h:126: error: expected â)â before â*â token
In file included from mod_ruby.h:166,
from mod_ruby.c:33:
apache_multipart_buffer.h:31: error: expected specifier-qualifier-list before ârequest_recâ
apache_multipart_buffer.h:44: error: storage class specified for parameter âmultipart_bufferâ
apache_multipart_buffer.h:46: error: expected declaration specifiers before âmultipart_bufferâ
apache_multipart_buffer.h:48: error: expected declaration specifiers before âtableâ
apache_multipart_buffer.h:49: error: expected â)â before â*â token
apache_multipart_buffer.h:50: error: expected â)â before â*â token
apache_multipart_buffer.h:51: error: expected â)â before â*â token
In file included from mod_ruby.h:167,
from mod_ruby.c:33:
apache_cookie.h:23: error: expected â=â, â,â, â;â, âasmâ or â__attribute__â before âApacheCookieJarâ
apache_cookie.h:26: error: expected specifier-qualifier-list before ârequest_recâ
apache_cookie.h:33: error: storage class specified for parameter âApacheCookieâ
apache_cookie.h:82: error: expected declaration specifiers before âApacheCookieâ
apache_cookie.h:83: error: expected declaration specifiers before âApacheCookieJarâ
apache_cookie.h:84: error: expected â)â before â*â token
apache_cookie.h:85: error: expected â)â before â*â token
apache_cookie.h:86: error: expected â)â before â*â token
apache_cookie.h:87: error: expected â)â before â*â token
In file included from mod_ruby.c:33:
mod_ruby.h:173: error: expected specifier-qualifier-list before âarray_headerâ
mod_ruby.h:178: error: storage class specified for parameter âruby_server_configâ
mod_ruby.h:182: error: expected specifier-qualifier-list before âtableâ
mod_ruby.h:200: error: storage class specified for parameter âruby_dir_configâ
mod_ruby.h:204: error: expected specifier-qualifier-list before âruby_server_configâ
mod_ruby.h:206: error: storage class specified for parameter âruby_library_contextâ
mod_ruby.h:209: error: expected specifier-qualifier-list before âtableâ
mod_ruby.h:211: error: storage class specified for parameter âruby_request_configâ
mod_ruby.h:234: error: expected â=â, â,â, â;â, âasmâ or â__attribute__â before âruby_moduleâ
mod_ruby.h:235: error: expected â=â, â,â, â;â, âasmâ or â__attribute__â before â*â token
mod_ruby.h:239: warning: type defaults to âintâ in declaration of âserver_recâ
mod_ruby.h:239: error: expected â;â, â,â or â)â before â*â token
mod_ruby.h:240: error: expected â)â before â*â token
mod_ruby.h:243: error: expected â)â before â*â token
mod_ruby.h:244: error: expected â)â before â*â token
In file included from mod_ruby.c:34:
ruby_config.h:33: error: expected â)â before â*â token
ruby_config.h:34: error: expected â)â before â*â token
ruby_config.h:35: error: expected â)â before â*â token
ruby_config.h:36: error: expected â)â before â*â token
ruby_config.h:37: error: expected â)â before â*â token
ruby_config.h:38: error: expected â)â before â*â token
ruby_config.h:39: error: expected â)â before â*â token
ruby_config.h:40: error: expected â)â before â*â token
ruby_config.h:41: error: expected â)â before â*â token
ruby_config.h:42: error: expected â)â before â*â token
ruby_config.h:43: error: expected â)â before â*â token
ruby_config.h:44: error: expected â)â before â*â token
ruby_config.h:45: error: expected â)â before â*â token
ruby_config.h:46: error: expected â)â before â*â token
ruby_config.h:47: error: expected â)â before â*â token
ruby_config.h:48: error: expected â)â before â*â token
ruby_config.h:49: error: expected â)â before â*â token
ruby_config.h:50: error: expected â)â before â*â token
ruby_config.h:51: error: expected â)â before â*â token
ruby_config.h:52: error: expected â)â before â*â token
ruby_config.h:53: error: expected â)â before â*â token
ruby_config.h:54: error: expected â)â before â*â token
ruby_config.h:55: error: expected â)â before â*â token
ruby_config.h:56: error: expected â)â before â*â token
ruby_config.h:57: error: expected â)â before â*â token
ruby_config.h:58: error: expected â)â before â*â token
ruby_config.h:59: error: expected â)â before â*â token
ruby_config.h:60: error: expected â)â before â*â token
In file included from mod_ruby.c:35:
apachelib.h:34: error: storage class specified for parameter ârb_mApacheâ
apachelib.h:35: error: storage class specified for parameter ârb_eApacheTimeoutErrorâ
apachelib.h:36: error: storage class specified for parameter ârb_requestâ
apachelib.h:37: error: storage class specified for parameter ârb_apache_objrefsâ
apachelib.h:47: error: storage class specified for parameter ârb_cApacheArrayHeaderâ
apachelib.h:49: error: expected â)â before â*â token
apachelib.h:52: error: storage class specified for parameter ârb_cApacheTableâ
apachelib.h:53: error: storage class specified for parameter ârb_cApacheRestrictedTableâ
apachelib.h:55: error: expected â)â before â*â token
apachelib.h:58: error: storage class specified for parameter ârb_cApacheConnectionâ
apachelib.h:60: error: expected â)â before â*â token
apachelib.h:63: error: storage class specified for parameter ârb_cApacheServerâ
apachelib.h:65: error: expected â)â before â*â token
apachelib.h:68: error: storage class specified for parameter ârb_cApacheRequestâ
apachelib.h:70: error: expected â)â before â*â token
apachelib.h:71: error: expected declaration specifiers before ârequest_recâ
apachelib.h:79: error: storage class specified for parameter ârb_cApacheBucketâ
apachelib.h:85: error: storage class specified for parameter ârb_eApacheRequestErrorâ
apachelib.h:88: error: storage class specified for parameter ârb_cApacheUploadâ
apachelib.h:90: error: expected â)â before â*â token
apachelib.h:93: error: storage class specified for parameter ârb_cApacheParamTableâ
apachelib.h:95: error: expected â)â before â*â token
apachelib.h:98: error: storage class specified for parameter ârb_cApacheCookieâ
apachelib.h:100: error: expected â)â before â*â token
apachelib.h:103: error: storage class specified for parameter ârb_cApacheMultiValâ
In file included from /usr/include/dlfcn.h:29,
from mod_ruby.c:43:
/usr/include/bits/dlfcn.h:61: error: storage class specified for parameter â_dl_mcount_wrapper_checkâ
In file included from mod_ruby.c:43:
/usr/include/dlfcn.h:46: error: storage class specified for parameter âLmid_tâ
/usr/include/dlfcn.h:58: error: storage class specified for parameter âdlopenâ
/usr/include/dlfcn.h:62: error: storage class specified for parameter âdlcloseâ
/usr/include/dlfcn.h:67: error: storage class specified for parameter âdlsymâ
/usr/include/dlfcn.h:71: error: expected â)â before â__nsidâ
/usr/include/dlfcn.h:78: error: storage class specified for parameter âdlvsymâ
/usr/include/dlfcn.h:84: error: storage class specified for parameter âdlerrorâ
/usr/include/dlfcn.h:96: error: storage class specified for parameter âDl_infoâ
/usr/include/dlfcn.h:100: error: expected declaration specifiers or â...â before âDl_infoâ
/usr/include/dlfcn.h:101: error: storage class specified for parameter âdladdrâ
/usr/include/dlfcn.h:101: error: nonnull argument with out-of-range operand number (argument 1, operand 2)
/usr/include/dlfcn.h:104: error: expected declaration specifiers or â...â before âDl_infoâ
/usr/include/dlfcn.h:105: error: storage class specified for parameter âdladdr1â
/usr/include/dlfcn.h:127: error: storage class specified for parameter âdlinfoâ
/usr/include/dlfcn.h:177: error: storage class specified for parameter âDl_serpathâ
/usr/include/dlfcn.h:185: error: expected specifier-qualifier-list before âDl_serpathâ
/usr/include/dlfcn.h:186: error: storage class specified for parameter âDl_serinfoâ
mod_ruby.c:79: error: storage class specified for parameter âenvironâ
mod_ruby.c:84: error: storage class specified for parameter âruby_errinfoâ
mod_ruby.c:85: error: storage class specified for parameter ârb_stdinâ
mod_ruby.c:86: error: storage class specified for parameter ârb_stdoutâ
mod_ruby.c:87: error: storage class specified for parameter ârb_stderrâ
mod_ruby.c:92: error: storage class specified for parameter âorig_stdinâ
mod_ruby.c:93: error: storage class specified for parameter âorig_stdoutâ
mod_ruby.c:98: error: storage class specified for parameter ârb_load_pathâ
mod_ruby.c:99: error: storage class specified for parameter âdefault_load_pathâ
mod_ruby.c:101: error: storage class specified for parameter ârb_prognameâ
mod_ruby.c:103: error: storage class specified for parameter âdefault_kcodeâ
mod_ruby.c:105: error: storage class specified for parameter âruby_is_runningâ
mod_ruby.c:105: error: parameter âruby_is_runningâ is initialized
mod_ruby.c:106: error: expected declaration specifiers before âarray_headerâ
mod_ruby.c:138: error: expected â)â before â*â token
mod_ruby.c:139: error: expected â)â before â*â token
mod_ruby.c:140: error: expected â)â before â*â token
mod_ruby.c:141: error: expected â)â before â*â token
mod_ruby.c:142: error: expected â)â before â*â token
mod_ruby.c:143: error: expected â)â before â*â token
mod_ruby.c:144: error: expected â)â before â*â token
mod_ruby.c:145: error: expected â)â before â*â token
mod_ruby.c:149: error: expected â)â before â*â token
mod_ruby.c:162: error: expected â=â, â,â, â;â, âasmâ or â__attribute__â before âruby_cmdsâ
mod_ruby.c:217: error: expected declaration specifiers before â;â token
mod_ruby.c:221: error: expected â)â before â*â token
mod_ruby.c:222: error: expected â)â before â*â token
mod_ruby.c:224: error: expected â)â before â*â token
mod_ruby.c:241: error: expected declaration specifiers before âmoduleâ
mod_ruby.c:250: error: expected declaration specifiers before â;â token
mod_ruby.c:302: error: storage class specified for parameter âprotect_call_arg_tâ
mod_ruby.c:305: error: expected â=â, â,â, â;â, âasmâ or â__attribute__â before â{â token
mod_ruby.c:313: error: expected â=â, â,â, â;â, âasmâ or â__attribute__â before â{â token
mod_ruby.c:340: error: expected â=â, â,â, â;â, âasmâ or â__attribute__â before â{â token
mod_ruby.c:357: error: expected â=â, â,â, â;â, âasmâ or â__attribute__â before â{â token
mod_ruby.c:453: error: expected â=â, â,â, â;â, âasmâ or â__attribute__â before â{â token
mod_ruby.c:493: warning: type defaults to âintâ in declaration of âserver_recâ
mod_ruby.c:493: error: expected â;â, â,â or â)â before â*â token
mod_ruby.c:508: error: expected â)â before â*â token
mod_ruby.c:521: error: expected â)â before â*â token
mod_ruby.c:537: error: expected â=â, â,â, â;â, âasmâ or â__attribute__â before â{â token
mod_ruby.c:541: error: expected â)â before â*â token
mod_ruby.c:568: error: expected declaration specifiers or â...â before âruby_server_configâ
mod_ruby.c:569: error: expected declaration specifiers or â...â before âruby_dir_configâ
mod_ruby.c:570: error: expected â=â, â,â, â;â, âasmâ or â__attribute__â before â{â token
mod_ruby.c:586: error: expected â=â, â,â, â;â, âasmâ or â__attribute__â before â{â token
mod_ruby.c:592: error: expected â)â before â*â token
mod_ruby.c:632: error: expected â)â before â*â token
mod_ruby.c:718: error: expected â=â, â,â, â;â, âasmâ or â__attribute__â before â{â token
mod_ruby.c:731: error: expected â=â, â,â, â;â, âasmâ or â__attribute__â before â{â token
mod_ruby.c:814: error: expected â=â, â,â, â;â, âasmâ or â__attribute__â before â{â token
mod_ruby.c:842: error: expected â=â, â,â, â;â, âasmâ or â__attribute__â before â*â token
mod_ruby.c:854: error: expected â)â before â*â token
mod_ruby.c:857: error: expected â)â before â*â token
mod_ruby.c:923: error: expected â)â before â*â token
mod_ruby.c:948: error: expected â=â, â,â, â;â, âasmâ or â__attribute__â before â{â token
mod_ruby.c:957: error: expected â)â before â*â token
mod_ruby.c:972: error: expected â)â before â*â token
mod_ruby.c:988: error: expected â=â, â,â, â;â, âasmâ or â__attribute__â before â{â token
mod_ruby.c:1006: error: storage class specified for parameter âtimeout_arg_tâ
mod_ruby.c:1009: error: expected â=â, â,â, â;â, âasmâ or â__attribute__â before â{â token
mod_ruby.c:1025: error: storage class specified for parameter ârun_safely_arg_tâ
mod_ruby.c:1028: error: expected â=â, â,â, â;â, âasmâ or â__attribute__â before â{â token
mod_ruby.c:1048: error: expected â=â, â,â, â;â, âasmâ or â__attribute__â before â{â token
mod_ruby.c:1076: error: expected â=â, â,â, â;â, âasmâ or â__attribute__â before â*â token
mod_ruby.c:1095: error: expected â)â before â*â token
mod_ruby.c:1111: error: expected â)â before â*â token
mod_ruby.c:1140: error: expected â=â, â,â, â;â, âasmâ or â__attribute__â before â{â token
mod_ruby.c:1145: error: expected â)â before â*â token
mod_ruby.c:1185: error: expected specifier-qualifier-list before ârequest_recâ
mod_ruby.c:1188: error: storage class specified for parameter âhandler_0_arg_tâ
mod_ruby.c:1191: error: expected â=â, â,â, â;â, âasmâ or â__attribute__â before â{â token
mod_ruby.c:1223: error: expected specifier-qualifier-list before ârequest_recâ
mod_ruby.c:1229: error: storage class specified for parameter âhandler_internal_arg_tâ
mod_ruby.c:1231: error: expected â)â before â*â token
mod_ruby.c:1291: error: expected â)â before â*â token
mod_ruby.c:1332: error: expected â)â before â*â token
mod_ruby.c:1351: error: expected â)â before â*â token
mod_ruby.c:1359: error: expected â)â before â*â token
mod_ruby.c:1370: error: expected â)â before â*â token
mod_ruby.c:1378: error: expected â)â before â*â token
mod_ruby.c:1386: error: expected â)â before â*â token
mod_ruby.c:1395: error: expected â)â before â*â token
mod_ruby.c:1404: error: expected â)â before â*â token
mod_ruby.c:1433: error: expected â=â, â,â, â;â, âasmâ or â__attribute__â before â{â token
mod_ruby.c:1442: error: expected â)â before â*â token
mod_ruby.c:1459: error: old-style parameter declarations in prototyped function definition
/usr/include/apr-1/apr_errno.h:52: error: parameter name omitted
mod_ruby.c:1459: error: expected â{â at end of input
make: *** [mod_ruby.o] Error 1

wzzrd said...

from mod_ruby.c:33:
/usr/include/apr-1/apr.h:19:24: error: apr-x86_64.h: No such file or directory
In file included from


This suggests you are missing 64-bit specific header Apache files. Are you sure you have all Apache development rpm's installed?